program: Orca
programVersion: 5.0.2
elementType: O O O O O O N N N C C C C C C C C C C C C C C C C C H H H H H H H H H H H H H H H H H H H
charge: 0
multiplicity: 1
keywords: wb97x-d3
keywords: def2-TZVPP
keywords: def2/J RIJCOSX
keywords: DEFGRID2
keywords: scfconv7
keywords: smallprint printgap noloewdin
keywords: NOSOSCF
formula: C17H19N3O6
InChI: InChI=1/C17H19N3O6/c1-10(20-25-5)11-7-6-8-12(15(11)16(21)24-4)26-17-18-13(22-2)9-14(19-17)23-3/h6-9H,1-5H3
45 atoms
O  1.229095 0.045967 1.618633
O  -0.697537 1.854892 0.494896
O  -1.173299 0.566608 -1.268828
O  -4.894013 0.647386 -0.265345
O  4.917172 1.678126 -0.393543
O  2.203237 -1.388742 -2.593619
N  -3.71269 0.371036 0.343082
N  3.052135 0.863185 0.635504
N  1.692258 -0.713532 -0.475678
C  -2.163594 -1.222139 1.01891
C  -1.023917 -0.421185 0.896034
C  0.108548 -0.744194 1.636494
C  -2.130425 -2.337641 1.850741
C  -3.432951 -0.869309 0.350224
C  0.134247 -1.852739 2.464245
C  -0.990868 -2.650642 2.569539
C  -0.991639 0.70331 -0.091061
C  -4.303565 -1.942564 -0.230427
C  2.018378 0.056647 0.535444
C  3.850597 0.893889 -0.420852
C  2.491056 -0.655929 -1.533832
C  3.623684 0.145186 -1.569379
C  -0.614971 2.994454 -0.347877
C  -5.099286 2.040353 -0.296466
C  5.15715 2.44047 0.777536
C  1.001344 -2.149289 -2.575246
H  -3.0155 -2.95073 1.959679
H  1.034665 -2.078488 3.01945
H  -0.979943 -3.515431 3.21915
H  -5.202381 -2.094434 0.370533
H  -3.771867 -2.888411 -0.298872
H  -4.635287 -1.665461 -1.230669
H  4.276077 0.189218 -2.427806
H  -1.563596 3.186948 -0.850588
H  0.164296 2.882745 -1.102472
H  -0.373105 3.829628 0.303303
H  -6.068985 2.194759 -0.766476
H  -5.115439 2.471427 0.70717
H  -4.333242 2.548815 -0.887579
H  6.078007 2.98655 0.58785
H  5.282418 1.807469 1.656532
H  4.349091 3.145629 0.975735
H  1.018874 -2.908367 -1.792625
H  0.127168 -1.515668 -2.426772
H  0.948575 -2.631847 -3.547947
totalener: -1274.91749795 hartree
nucrepener: 2469.52235657 hartree
electener: -3744.43985452 hartree
oneelecener: -6649.86341181 hartree
twoeener: 2905.42355728 hartree
kineticenergy: 1269.83659617 hartree
xcener: -119.072867771144 hartree
chargesum: 0.0000000
charge: -0.267911 -0.240082 -0.356417 -0.209420 -0.268163 -0.267295 -0.139645 -0.360558 -0.382141 0.040408 0.056415 0.240876 -0.175998 0.189853 -0.176004 -0.110527 0.291685 -0.281410 0.333503 0.393633 0.382038 -0.305332 -0.138875 -0.114082 -0.118205 -0.121968 0.126346 0.125576 0.127146 0.108317 0.090131 0.107989 0.122080 0.105306 0.109009 0.119792 0.105456 0.098905 0.090715 0.117977 0.106581 0.105556 0.101363 0.119856 0.117523
qa: -0.2679 -0.2401 -0.3564 -0.2094 -0.2682 -0.2673 -0.1396 -0.3606 -0.3821 0.0404 0.0564 0.2409 -0.1760 0.1899 -0.1760 -0.1105 0.2917 -0.2814 0.3335 0.3936 0.3820 -0.3053 -0.1389 -0.1141 -0.1182 -0.1220 0.1263 0.1256 0.1271 0.1083 0.0901 0.1080 0.1221 0.1053 0.1090 0.1198 0.1055 0.0989 0.0907 0.1180 0.1066 0.1056 0.1014 0.1199 0.1175
va: 2.1376 2.1419 2.1232 1.9742 2.1376 2.1482 2.8683 2.9520 2.9279 3.7693 3.6655 3.8090 3.9484 3.7031 4.0796 3.9703 4.1602 3.9527 4.3036 4.0121 4.0781 3.9232 3.9157 3.9294 3.8780 3.8629 1.0032 1.0082 1.0008 0.9981 1.0061 1.0110 1.0237 0.9923 0.9951 0.9951 0.9966 0.9958 0.9900 0.9925 0.9998 0.9990 0.9968 1.0039 0.9946
dispcorr: -0.022870903 hartree
energy: -1274.940368850861
dipole: -10.99840 10.60715 -0.39125 2.96869 -3.08026 -0.11157 -3.72029 3.96332 0.24303
magnitude: 0.47391 au
magnitude: 1.20458 debye
