program: Orca
programVersion: 5.0.2
elementType: O O O O O O N N N C C C C C C C C C C C C C C C C C H H H H H H H H H H H H H H H H H H H
charge: 0
multiplicity: 1
keywords: wb97x-d3
keywords: def2-TZVPP
keywords: def2/J RIJCOSX
keywords: DEFGRID2
keywords: scfconv7
keywords: smallprint printgap noloewdin
keywords: NOSOSCF
formula: C17H19N3O6
InChI: InChI=1/C17H19N3O6/c1-10(20-25-5)11-7-6-8-12(15(11)16(21)24-4)26-17-18-13(22-2)9-14(19-17)23-3/h6-9H,1-5H3
45 atoms
O  1.066335 -1.356775 1.240482
O  -0.882649 1.417598 -0.612323
O  -0.067333 1.314175 1.466181
O  -4.403197 1.982019 0.556834
O  2.132489 0.15833 -2.922439
O  5.150833 0.435829 0.603049
N  -3.422678 1.07057 0.784673
N  1.561439 -0.619442 -0.854513
N  3.090899 -0.482458 0.93681
C  -2.434454 -0.952048 0.208045
C  -1.117817 -0.609209 0.529836
C  -0.21382 -1.623807 0.838412
C  -2.803997 -2.294115 0.166837
C  -3.475268 0.074839 -0.004235
C  -0.58966 -2.954317 0.800325
C  -1.889681 -3.287638 0.463689
C  -0.644419 0.807682 0.547276
C  -4.512064 -0.108188 -1.071665
C  1.93471 -0.789217 0.393977
C  2.451094 -0.046541 -1.654359
C  3.966937 0.088165 0.125349
C  3.706068 0.346969 -1.216515
C  -0.472346 2.772855 -0.699945
C  -4.263863 3.060564 1.453039
C  0.857012 -0.276091 -3.370563
C  5.408449 0.206585 1.979563
H  -3.826467 -2.561177 -0.066312
H  0.140202 -3.716642 1.036611
H  -2.191279 -4.326029 0.43976
H  -5.50429 -0.261435 -0.64301
H  -4.277133 -0.954391 -1.712636
H  -4.574041 0.7830 -1.697026
H  4.428465 0.814321 -1.867894
H  -0.981561 3.394437 0.038133
H  -0.74187 3.104394 -1.699268
H  0.604298 2.877219 -0.561033
H  -5.085648 3.742217 1.239973
H  -4.327317 2.735055 2.493591
H  -3.31667 3.587245 1.310298
H  0.04757 0.192749 -2.812271
H  0.749082 -1.358356 -3.289106
H  0.801151 0.014974 -4.416652
H  4.701962 0.738038 2.617319
H  5.36536 -0.853956 2.228634
H  6.413666 0.58129 2.155058
totalener: -1274.91654139 hartree
nucrepener: 2483.82593568 hartree
electener: -3758.74247707 hartree
oneelecener: -6678.31290596 hartree
twoeener: 2919.57042889 hartree
kineticenergy: 1269.84311525 hartree
xcener: -119.075215874637 hartree
chargesum: 0.0000000
charge: -0.260489 -0.266622 -0.317095 -0.208626 -0.269342 -0.268983 -0.143418 -0.387430 -0.353685 0.023806 0.027215 0.243151 -0.172987 0.175517 -0.171684 -0.111492 0.312541 -0.280281 0.349027 0.365383 0.404537 -0.308561 -0.134343 -0.105704 -0.115350 -0.120803 0.124863 0.125275 0.127165 0.111362 0.088611 0.104739 0.122052 0.110632 0.111659 0.116557 0.103924 0.103678 0.082755 0.099858 0.106394 0.119604 0.113567 0.106185 0.116839
qa: -0.2605 -0.2666 -0.3171 -0.2086 -0.2693 -0.2690 -0.1434 -0.3874 -0.3537 0.0238 0.0272 0.2432 -0.1730 0.1755 -0.1717 -0.1115 0.3125 -0.2803 0.3490 0.3654 0.4045 -0.3086 -0.1343 -0.1057 -0.1153 -0.1208 0.1249 0.1253 0.1272 0.1114 0.0886 0.1047 0.1221 0.1106 0.1117 0.1166 0.1039 0.1037 0.0828 0.0999 0.1064 0.1196 0.1136 0.1062 0.1168
va: 2.1567 2.0777 2.1904 1.9707 2.1330 2.1403 2.8585 2.9126 2.9683 3.7848 3.6587 3.7774 3.9571 3.7151 4.0676 3.9725 4.1666 3.9510 4.3107 4.0682 4.0150 3.9228 3.8911 3.9287 3.8734 3.8751 1.0036 1.0095 1.0010 0.9992 1.0073 1.0089 1.0240 0.9972 0.9932 0.9958 0.9936 0.9986 0.9897 0.9977 0.9992 0.9935 0.9984 0.9991 0.9923
dispcorr: -0.023588855 hartree
energy: -1274.940130244044
dipole: -11.02295 10.21062 -0.81234 7.84963 -7.93536 -0.08573 -5.17538 4.16641 -1.00897
magnitude: 1.29818 au
magnitude: 3.29971 debye
