program: Orca
programVersion: 5.0.2
elementType: O O O O O O N N N C C C C C C C C C C C C C C C C C H H H H H H H H H H H H H H H H H H H
charge: 0
multiplicity: 1
keywords: wb97x-d3
keywords: def2-TZVPP
keywords: def2/J RIJCOSX
keywords: DEFGRID2
keywords: scfconv7
keywords: smallprint printgap noloewdin
keywords: NOSOSCF
formula: C17H19N3O6
InChI: InChI=1/C17H19N3O6/c1-10(20-25-5)11-7-6-8-12(15(11)16(21)24-4)26-17-18-13(22-2)9-14(19-17)23-3/h6-9H,1-5H3
45 atoms
O  0.982894 -1.559386 -1.087342
O  -0.840477 1.446458 0.538383
O  -0.136992 1.094539 -1.554778
O  -4.40129 1.924455 -0.535135
O  2.338065 0.521389 2.734008
O  5.042391 0.392041 -1.046638
N  -3.44632 0.971672 -0.690487
N  1.621737 -0.533045 0.840875
N  2.995571 -0.610641 -1.075709
C  -2.447751 -0.974677 0.08774
C  -1.147987 -0.694181 -0.344454
C  -0.271359 -1.752525 -0.577303
C  -2.826545 -2.295168 0.313883
C  -3.464825 0.088398 0.223775
C  -0.656599 -3.062731 -0.354922
C  -1.938655 -3.331446 0.091606
C  -0.667477 0.704803 -0.554359
C  -4.440106 0.061765 1.361227
C  1.897788 -0.863115 -0.400703
C  2.55603 0.159066 1.479598
C  3.914882 0.085394 -0.426262
C  3.756804 0.517529 0.886699
C  -0.431835 2.801566 0.445287
C  -4.31554 2.854325 -1.590854
C  1.116442 0.124483 3.340323
C  5.1905 -0.012429 -2.399047
H  -3.836268 -2.51579 0.63487
H  0.050519 -3.860251 -0.538629
H  -2.246956 -4.354526 0.259293
H  -4.48591 1.036232 1.84719
H  -4.158299 -0.675829 2.108358
H  -5.450032 -0.164373 1.014497
H  4.514252 1.084949 1.404923
H  -0.983268 3.333735 -0.331069
H  0.635261 2.887454 0.237052
H  -0.648695 3.247398 1.412387
H  -4.475245 2.381228 -2.562116
H  -5.101173 3.587259 -1.416096
H  -3.348282 3.362965 -1.606574
H  1.143997 0.533754 4.347101
H  1.026388 -0.96117 3.391736
H  0.251485 0.515157 2.805386
H  4.414599 0.413591 -3.035402
H  6.163614 0.358431 -2.710531
H  5.162422 -1.097252 -2.503421
totalener: -1274.91642488 hartree
nucrepener: 2486.57550925 hartree
electener: -3761.49193413 hartree
oneelecener: -6683.82944182 hartree
twoeener: 2922.33750768 hartree
kineticenergy: 1269.84223788 hartree
xcener: -119.075295710874 hartree
chargesum: -0.0000000
charge: -0.260465 -0.267454 -0.316516 -0.209509 -0.269522 -0.268983 -0.142769 -0.383715 -0.352457 0.022091 0.025581 0.242968 -0.172125 0.174303 -0.174241 -0.110900 0.315044 -0.281143 0.344732 0.364544 0.406096 -0.308019 -0.133879 -0.105097 -0.115372 -0.120822 0.125259 0.125493 0.127085 0.104303 0.089966 0.111107 0.121802 0.110922 0.116083 0.112420 0.103221 0.103674 0.083556 0.119426 0.106270 0.100365 0.114260 0.116293 0.106125
qa: -0.2605 -0.2675 -0.3165 -0.2095 -0.2695 -0.2690 -0.1428 -0.3837 -0.3525 0.0221 0.0256 0.2430 -0.1721 0.1743 -0.1742 -0.1109 0.3150 -0.2811 0.3447 0.3645 0.4061 -0.3080 -0.1339 -0.1051 -0.1154 -0.1208 0.1253 0.1255 0.1271 0.1043 0.0900 0.1111 0.1218 0.1109 0.1161 0.1124 0.1032 0.1037 0.0836 0.1194 0.1063 0.1004 0.1143 0.1163 0.1061
va: 2.1564 2.0764 2.1903 1.9696 2.1322 2.1407 2.8590 2.9134 2.9673 3.7872 3.6556 3.7820 3.9577 3.7133 4.0624 3.9716 4.1661 3.9516 4.3179 4.0651 4.0137 3.9250 3.8910 3.9285 3.8725 3.8753 1.0035 1.0099 1.0010 1.0098 1.0066 0.9989 1.0241 0.9971 0.9957 0.9930 0.9985 0.9935 0.9903 0.9934 0.9999 0.9977 0.9982 0.9924 0.9992
dispcorr: -0.023682946 hartree
energy: -1274.940107825622
dipole: -10.74347 9.97419 -0.76928 8.56760 -8.51152 0.05608 4.66305 -3.62867 1.03438
magnitude: 1.29031 au
magnitude: 3.27970 debye
