program: Orca
programVersion: 5.0.2
elementType: O O O O O O N N N C C C C C C C C C C C C C C C C C H H H H H H H H H H H H H H H H H H H
charge: 0
multiplicity: 1
keywords: wb97x-d3
keywords: def2-TZVPP
keywords: def2/J RIJCOSX
keywords: DEFGRID2
keywords: scfconv7
keywords: smallprint printgap noloewdin
keywords: NOSOSCF
formula: C17H19N3O6
InChI: InChI=1/C17H19N3O6/c1-10(20-25-5)11-7-6-8-12(15(11)16(21)24-4)26-17-18-13(22-2)9-14(19-17)23-3/h6-9H,1-5H3
45 atoms
O  1.051718 -1.41486 1.219649
O  -0.871079 1.385931 -0.61669
O  -0.063172 1.263575 1.463686
O  -4.371338 1.981547 0.570463
O  2.128012 0.186016 -2.907524
O  5.095397 0.495078 0.657971
N  -3.400987 1.05552 0.778831
N  1.555079 -0.638478 -0.858533
N  3.059346 -0.4882 0.953262
C  -2.445743 -0.976459 0.187033
C  -1.126703 -0.6458 0.512416
C  -0.22901 -1.669155 0.811874
C  -2.824073 -2.315311 0.130364
C  -3.477558 0.062146 -0.011093
C  -0.614088 -2.996818 0.759242
C  -1.915798 -3.31759 0.416826
C  -0.642285 0.767476 0.540283
C  -4.52961 -0.107158 -1.065504
C  1.917537 -0.815416 0.392231
C  2.437246 -0.028527 -1.638866
C  3.92757 0.120751 0.161301
C  3.674556 0.394724 -1.178996
C  -0.438414 2.73395 -0.700802
C  -4.191402 3.061423 1.457761
C  0.866169 -0.269047 -3.37456
C  5.340254 0.263103 2.036165
H  -3.847723 -2.57412 -0.106922
H  0.109535 -3.767294 0.98827
H  -2.22318 -4.353943 0.38106
H  -4.61985 0.800248 -1.662455
H  -5.510587 -0.292364 -0.624246
H  -4.291522 -0.930072 -1.734681
H  4.389851 0.89556 -1.813074
H  0.639673 2.819993 -0.559877
H  -0.938165 3.363051 0.037359
H  -0.700342 3.071544 -1.700111
H  -5.007546 3.755005 1.263698
H  -4.231793 2.740944 2.500837
H  -3.240417 3.572983 1.28783
H  0.818106 0.027579 -4.419419
H  0.041747 0.182048 -2.823569
H  0.776387 -1.353419 -3.300697
H  6.329394 0.670328 2.229867
H  4.606539 0.764899 2.667277
H  5.329854 -0.800321 2.276382
totalener: -1274.91628093 hartree
nucrepener: 2488.10569248 hartree
electener: -3763.02197340 hartree
oneelecener: -6686.87510179 hartree
twoeener: 2923.85312838 hartree
kineticenergy: 1269.84492609 hartree
xcener: -119.076072034592 hartree
chargesum: 0.0000000
charge: -0.260742 -0.266353 -0.316318 -0.209727 -0.269292 -0.269065 -0.142037 -0.384375 -0.352460 0.019765 0.027917 0.240301 -0.171855 0.175476 -0.172226 -0.111401 0.315706 -0.281301 0.346111 0.363678 0.406759 -0.309254 -0.134533 -0.106087 -0.115739 -0.121163 0.125046 0.125165 0.127061 0.104159 0.111644 0.089524 0.121767 0.116024 0.111050 0.112012 0.104463 0.104036 0.082836 0.119691 0.100191 0.106635 0.116796 0.113954 0.106159
qa: -0.2607 -0.2664 -0.3163 -0.2097 -0.2693 -0.2691 -0.1420 -0.3844 -0.3525 0.0198 0.0279 0.2403 -0.1719 0.1755 -0.1722 -0.1114 0.3157 -0.2813 0.3461 0.3637 0.4068 -0.3093 -0.1345 -0.1061 -0.1157 -0.1212 0.1250 0.1252 0.1271 0.1042 0.1116 0.0895 0.1218 0.1160 0.1110 0.1120 0.1045 0.1040 0.0828 0.1197 0.1002 0.1066 0.1168 0.1140 0.1062
va: 2.1567 2.0761 2.1908 1.9707 2.1318 2.1403 2.8592 2.9115 2.9679 3.7898 3.6580 3.7817 3.9564 3.7169 4.0648 3.9726 4.1678 3.9506 4.3156 4.0659 4.0130 3.9231 3.8911 3.9285 3.8724 3.8753 1.0035 1.0098 1.0010 1.0101 0.9986 1.0067 1.0242 0.9958 0.9972 0.9930 0.9936 0.9988 0.9892 0.9935 0.9979 0.9994 0.9922 0.9984 0.9990
dispcorr: -0.023749471 hartree
energy: -1274.940030399251
dipole: -10.88058 10.07053 -0.81005 8.06400 -8.11673 -0.05273 -5.10864 4.10277 -1.00587
magnitude: 1.29256 au
magnitude: 3.28544 debye
