program: Orca
programVersion: 5.0.2
elementType: S O O O O N N C C C C C C C C C C C C C C C H H H H H H H H H H H H H H
charge: 0
multiplicity: 1
keywords: wb97x-d3
keywords: def2-TZVPP
keywords: def2/J RIJCOSX
keywords: DEFGRID2
keywords: scfconv7
keywords: smallprint printgap noloewdin
keywords: NOSOSCF
formula: C15H14N2O4S
InChI: InChI=1/C15H14N2O4S/c1-8-9-5-4-6-10(13(9)14(18)21-8)22-15-16-11(19-2)7-12(17-15)20-3/h4-8H,1-3H3
36 atoms
S  0.541908 1.289973 -1.110448
O  -3.270533 -1.224329 -1.88047
O  -1.281963 -0.802807 -2.775319
O  1.630463 -1.496283 2.845766
O  5.036624 -0.259034 -0.056651
N  1.152516 -0.229287 0.999706
N  2.885051 0.416013 -0.473339
C  -4.069658 -0.839196 -0.747005
C  -3.195537 0.135559 -0.026138
C  -2.003039 0.264618 -0.713357
C  -0.999343 1.114072 -0.259678
C  -2.078279 -0.610286 -1.894786
C  -5.391605 -0.267794 -1.207196
C  -3.437259 0.84633 1.13501
C  -1.246254 1.849312 0.890632
C  -2.447393 1.708952 1.581972
C  1.630574 0.382008 -0.060121
C  2.039937 -0.870918 1.751371
C  3.756599 -0.239157 0.283595
C  3.389936 -0.915772 1.439973
C  0.24915 -1.431716 3.196051
C  5.450996 0.419495 -1.239334
H  -4.234634 -1.736284 -0.144498
H  -5.956993 -1.004547 -1.776849
H  -5.986721 0.007496 -0.336954
H  -5.24744 0.621858 -1.819922
H  -4.367511 0.741733 1.677432
H  -0.493366 2.53086 1.263034
H  -2.605832 2.287763 2.481794
H  4.108493 -1.438694 2.054207
H  0.158599 -1.978878 4.130492
H  -0.381284 -1.903207 2.4424
H  -0.082427 -0.404606 3.348369
H  6.52447 0.264174 -1.3041
H  5.247548 1.488572 -1.185104
H  4.976466 0.006576 -2.129188
elementType: S O N C H
totalener: -1388.75398249 hartree
nucrepener: 1937.56601327 hartree
electener: -3326.31999575 hartree
oneelecener: -5751.77642682 hartree
twoeener: 2425.45643107 hartree
cpcmener: -0.04113404 hartree
kineticenergy: 1384.04518280 hartree
xcener: -112.579475306306 hartree
chargesum: 0.0000000
charge: -0.020919 -0.286472 -0.440021 -0.305982 -0.303745 -0.410611 -0.398467 0.247624 -0.031864 -0.112802 0.087371 0.400268 -0.261371 -0.149716 -0.158903 -0.095785 0.229741 0.414665 0.438481 -0.331551 -0.114456 -0.111243 0.104472 0.104214 0.097926 0.096544 0.155866 0.135871 0.165528 0.143412 0.134235 0.112089 0.110855 0.130646 0.111872 0.112224
qa: -0.0209 -0.2865 -0.4400 -0.3060 -0.3037 -0.4106 -0.3985 0.2476 -0.0319 -0.1128 0.0874 0.4003 -0.2614 -0.1497 -0.1589 -0.0958 0.2297 0.4147 0.4385 -0.3316 -0.1145 -0.1112 0.1045 0.1042 0.0979 0.0965 0.1559 0.1359 0.1655 0.1434 0.1342 0.1121 0.1109 0.1306 0.1119 0.1122
va: 2.4254 2.1388 2.0619 2.1128 2.1110 2.9673 2.9551 3.8388 3.8501 3.6670 3.7754 4.3062 3.9275 3.9208 3.9668 3.8667 4.2534 4.0162 3.9816 3.9365 3.8533 3.8444 0.9998 1.0064 1.0064 1.0069 0.9969 1.0055 0.9862 1.0169 0.9948 0.9944 0.9922 0.9936 0.9968 0.9966
dispcorr: -0.016629775 hartree
energy: -1388.770612260848
dipole: -7.74767 5.76038 -1.98729 -0.63948 1.34011 0.70063 8.15841 -5.07120 3.08721
magnitude: 3.73779 au
magnitude: 9.50071 debye
