program: Gaussian 09
title: 000068944
version: EM64L-G09RevD.01
frameworkgroup: C1[X(C7H11N3O3)]
method: RPBEPBE
basis: SDD
operation: Freq
keyword: #p
keyword: freq=noraman
keyword: PBEPBE/SDD
title: #p freq=noraman PBEPBE/SDD
converged: YES YES NO NO
title: Mulliken charges:
elementType: O O O N N N C C C C C C C H H H H H H H H H H H
charge: -0.446373 -0.207557 -0.239389 -0.192415 -0.089859 0.046105 -0.386442 -0.349037 0.243195 0.325167 -0.328451 -0.357140 -0.756764 0.263228 0.214406 0.219220 0.252860 0.206871 0.181354 0.290807 0.242583 0.277747 0.240672 0.349209
chargesum: 0.00000
title: Mulliken charges with hydrogens summed into heavy atoms:
elementType: O O O N N N C C C C C C C
charge: -0.097164 -0.207557 -0.239389 -0.192415 -0.089859 0.046105 0.091192 0.123043 0.243195 0.325167 0.059774 -0.066333 0.004239
polarizability: 1.28055636e+02 9.34917942e-01 1.37022466e+02 1.45479612e+01 -1.38558677e+00 6.98031020e+01
1716.lowfreq: -8.6975 -4.6483 -0.0008 -0.0007 0.0004 7.8776 31.6202 47.2295 67.0947
frequency: 31.4770 47.2069 67.0828 87.9535 114.1130 119.0209 142.0294 199.3939 234.1438 263.8216 278.8885 306.0507 321.6540 374.0540 419.8481 450.9173 545.1589 602.7652 661.0457 678.6491 692.7711 751.3587 757.1294 778.0468 866.5277 868.2585 939.5311 979.9491 983.1536 1022.0042 1045.8174 1057.5348 1113.1095 1137.5562 1172.2063 1190.3533 1216.1029 1221.5841 1267.7733 1282.9563 1300.9167 1308.2676 1330.8546 1349.8636 1369.3108 1399.4088 1409.9078 1421.8984 1454.6989 1465.1360 1469.4542 1474.0219 1483.6068 1487.5533 1491.2534 2926.1936 2981.6460 2986.4629 3013.0094 3030.0555 3063.2773 3079.8331 3106.0758 3125.3215 3253.0561 3573.6499
redmass: 6.1409 6.6925 2.1968 5.0532 2.7740 4.4402 1.0465 4.3500 4.8312 1.1069 5.5494 4.2520 2.6381 5.1014 6.5070 3.7268 4.4421 4.9438 4.9846 5.2713 7.7388 8.0995 3.9830 1.2358 1.3924 1.4203 2.7191 5.9106 1.7614 2.7716 1.5285 2.9636 2.7091 1.8804 2.2035 1.7073 2.7588 1.4418 1.8398 1.1371 1.2707 4.6343 8.1073 2.0385 1.5131 1.2248 3.1184 1.4555 1.2186 4.3432 1.0898 1.1293 1.2130 3.1928 1.1517 1.0578 1.1033 1.0397 1.0608 1.0637 1.0974 1.0999 1.1029 1.0967 1.0995 1.0666
irintensity: 1.0155 1.6308 11.2882 0.4518 0.3503 0.4654 0.1908 3.3059 3.8882 147.7287 8.7135 3.5451 5.8806 2.3828 2.4632 27.1909 2.6383 1.2306 4.8562 7.4731 5.7001 7.7711 12.1663 1.7945 4.6007 19.5467 5.3975 76.0948 5.7934 8.1331 2.0716 12.8370 15.3833 10.6525 161.3238 62.1598 31.6764 33.6424 23.9938 4.1934 17.0074 47.8775 281.3144 4.6404 20.6332 7.4380 59.4465 2.4566 13.0814 152.6600 9.6952 29.0613 6.2421 9.1479 18.1903 74.1657 40.7567 14.1000 13.3802 31.2079 12.0678 14.3273 9.0612 3.5993 2.5443 4.1588
temp: 298.150 k
press: 1.00000 atm
elementType: 8 8 8 7 7 7 6 6 6 6 6 6 6 1 1 1 1 1 1 1 1 1 1 1
symmnumber: 1
zpe: 488338.0 jmol-1
zpe.correction: 0.185998 hartree
zpe.thermalcorrener: 0.199424 hartree
zpe.thermalcorrenthalpy: 0.200368 hartree
zpe.thermalcorrgfe: 0.144409 hartree
zpe.sumelectzpe: -662.167823 hartree
zpe.sumelectthermal: -662.154397 hartree
zpe.sumelectthermalent: -662.153453 hartree
zpe.sumelectthermalfe: -662.209413 hartree
dipole: 4.1995 3.7080 2.6811
dipole: 6.2108
quadrupole: -73.4591 -85.4719 -77.7836
quadrupole: -2.1283 5.8513 3.0425
quadrupole: 5.4458 -6.5670 1.1212 -2.1283 5.8513 3.0425
hfenergy: -662.3538214 hartree
pointgroup: C01 [X(C7H11N3O3)]
dipole: 1.6227679 1.4650095 1.0913612 debye
dipolederiv: -0.6389666 -0.0433578 0.2977505 -0.0524479 -0.5304809 -0.0953971 0.3848344 -0.1211619 -0.4524718 -0.646201 -0.3877111 -0.1190775 -0.2404249 -0.7917346 -0.0554578 -0.1487313 -0.1334015 -0.2782191 -0.7668423 0.2466195 -0.1864771 0.1197711 -0.6441619 0.072952 -0.2023017 0.1193691 -0.3184228 -0.6750707 0.1967607 -0.1566427 0.1707365 -0.05355 0.0314029 -0.2110346 0.0587943 -0.1607645 -0.5454632 -0.4825494 -0.0519251 -0.0918013 -0.7321331 -0.005851 -0.1163541 -0.1923711 -0.2835319 1.1384129 0.0227693 0.3157522 0.0377625 1.9280516 -0.0699515 0.3549191 -0.052324 0.3391089 0.4938117 -0.020841 0.0454045 -0.0007347 0.1705587 0.0153273 0.0859669 0.0320971 0.2351102 -0.1371878 0.0291556 -0.0325303 0.0299342 0.0852931 -0.0082187 -0.077882 -0.024996 -0.0050744 0.5226204 0.4821195 0.1567356 -0.1672741 0.4210753 -0.0161173 0.2213069 0.2250421 0.090938 0.205112 0.3860452 0.0208624 0.2127225 -1.0606055 0.0992764 0.0482035 0.1826276 0.0441472 0.6180154 -0.019174 -0.2149782 -0.0146714 0.4133311 0.0776966 -0.168531 0.0736626 0.4431644 0.0307004 -0.206211 0.0847426 0.0398321 0.6369695 -0.0373107 0.0468075 -0.1000455 -0.0462769 -0.0212432 -0.1635466 -0.0298191 -0.037011 -0.1463096 -0.0124542 -0.0468488 -0.0912314 0.0573515 0.0485738 -0.0069748 0.0115613 0.0500466 0.0393184 0.1124004 0.0273687 0.0359484 0.0336758 0.0057466 -0.0235748 -0.0230034 -0.0529037 -0.0420634 -0.1315195 -0.0008883 -0.0701129 0.0257193 0.0573088 0.0297894 0.0063992 -0.0077412 -0.0555686 0.1029436 -0.0117837 0.0833336 0.0018737 0.0616901 -0.0544618 -0.0379627 -0.0285677 -0.0058403 -0.0840116 -0.0770744 -0.0506211 0.012702 0.0114202 -0.0081212 0.0490562 0.010083 -0.1148555 0.1364548 0.0520657 0.0890055 -0.06947 -0.0257897 -0.0306711 -0.0076453 -0.0493709 -0.0906629 -0.1715079 0.0044691 -0.1217368 -0.1327444 0.0922684 -0.0440018 -0.0363124 -0.0272734 0.0873407 -0.0093469 -0.0375192 -0.0154686 0.1668363 -0.0663796 -0.0562468 0.0796511 -0.0054951 0.0542809 -0.0336491 0.0916882 0.0044226 0.0598956 0.0533124 0.1118572 -0.0430625 0.0397111 0.0384627 0.0255859 -0.0411857 0.065112 0.1108287 0.0991058 -0.0489297 -0.0411231 -0.0333573 0.0380633 0.007341 -0.0428821 -0.0572355 -0.0913634 0.0850452 0.0912563 -0.0873564 0.0984748 0.3552213 0.0494123 -0.134613 0.0612915 0.2169876 unknown
polarizability: 127.8739917|0.51163|137.0697551|14.8840096|0.1320981|69.9374572 unknown
InChI: InChI=1S/C7H11N3O3/c1-6-8-5-7(10(12)13)9(6)3-2-4-11/h5,11H,2-4H2,1H3
charge 0 multiplicity 1
24 atoms
O  4.336592 -0.298928 -0.862849
O  -2.182771 -2.568077 -0.299766
O  -0.055312 -2.338789 0.521978
N  -0.35026 0.531917 0.33879
N  -2.171304 1.6489 -0.462505
N  -1.1740 -1.843531 0.067316
C  1.019592 0.311964 0.862798
C  2.040742 0.061248 -0.267451
C  -0.91348 1.773307 0.059629
C  -1.315414 -0.425514 -0.042039
C  3.43633 -0.226921 0.296473
C  -2.424934 0.291193 -0.524774
C  -0.232594 3.082188 0.307061
H  0.992904 -0.550267 1.546574
H  1.293714 1.212634 1.440808
H  2.10476 0.942192 -0.933488
H  1.719597 -0.801303 -0.876823
H  3.42722 -1.184545 0.859987
H  3.751513 0.586234 0.988773
H  -3.359068 -0.115561 -0.901869
H  0.743088 3.149651 -0.207579
H  -0.88619 3.880099 -0.075935
H  -0.060236 3.265577 1.384373
H  5.23441 -0.595868 -0.56988
