program: Orca
programVersion: 5.0.2
elementType: S O O O O N N C C C C C C C C C C C C C C C H H H H H H H H H H H H H H
charge: 0
multiplicity: 1
keywords: wb97x-d3
keywords: def2-TZVPP
keywords: def2/J RIJCOSX
keywords: DEFGRID2
keywords: scfconv7
keywords: smallprint printgap noloewdin
keywords: NOSOSCF
formula: C15H14N2O4S
InChI: InChI=1/C15H14N2O4S/c1-8-9-5-4-6-10(13(9)14(18)21-8)22-15-16-11(19-2)7-12(17-15)20-3/h4-8H,1-3H3
36 atoms
S  0.509689 0.562186 -1.412601
O  -3.731245 -1.24909 -1.4817
O  -1.757126 -1.438139 -2.48563
O  1.955888 -0.609437 3.192725
O  5.09398 -0.539185 -0.225678
N  1.304953 -0.088081 1.059665
N  2.906066 -0.021212 -0.678189
C  -4.368359 -0.474047 -0.450882
C  -3.278472 0.433361 0.02184
C  -2.128275 0.165671 -0.6986
C  -0.951578 0.870657 -0.467442
C  -2.445992 -0.906228 -1.655086
C  -5.577861 0.24312 -1.007181
C  -3.303635 1.40935 0.999629
C  -0.978525 1.872872 0.493889
C  -2.136596 2.127326 1.222877
C  1.688071 0.105665 -0.181782
C  2.26205 -0.425147 1.916813
C  3.845375 -0.381282 0.187461
C  3.583056 -0.596408 1.534118
C  0.608906 -0.411905 3.613685
C  5.400572 -0.341205 -1.602542
H  -4.670378 -1.166788 0.338906
H  -6.309991 -0.467882 -1.389002
H  -6.054175 0.814674 -0.21106
H  -5.298749 0.930891 -1.804972
H  -4.200356 1.615943 1.568808
H  -0.091602 2.461873 0.683075
H  -2.123193 2.908648 1.970908
H  4.356639 -0.874704 2.235161
H  0.258222 0.597093 3.395611
H  0.612942 -0.563039 4.689709
H  -0.06745 -1.133028 3.155101
H  4.867112 -1.045829 -2.24027
H  6.468756 -0.51915 -1.69285
H  5.18081 0.67611 -1.925342
elementType: S O N C H
totalener: -1388.75387222 hartree
nucrepener: 1923.41692016 hartree
electener: -3312.17079238 hartree
oneelecener: -5723.32918755 hartree
twoeener: 2411.15839517 hartree
cpcmener: -0.04082803 hartree
kineticenergy: 1384.04165416 hartree
xcener: -112.580010207044 hartree
chargesum: -0.0000000
charge: -0.002982 -0.287531 -0.440507 -0.305354 -0.303578 -0.406882 -0.395814 0.248517 -0.029624 -0.080332 0.048530 0.394735 -0.263278 -0.159676 -0.185767 -0.084964 0.228049 0.422300 0.438971 -0.329596 -0.114527 -0.112260 0.103729 0.103814 0.098327 0.096411 0.156408 0.140186 0.166279 0.143793 0.109943 0.133995 0.113539 0.113216 0.130541 0.111389
qa: -0.0030 -0.2875 -0.4405 -0.3054 -0.3036 -0.4069 -0.3958 0.2485 -0.0296 -0.0803 0.0485 0.3947 -0.2633 -0.1597 -0.1858 -0.0850 0.2280 0.4223 0.4390 -0.3296 -0.1145 -0.1123 0.1037 0.1038 0.0983 0.0964 0.1564 0.1402 0.1663 0.1438 0.1099 0.1340 0.1135 0.1132 0.1305 0.1114
va: 2.4597 2.1378 2.0621 2.1125 2.1113 2.9724 2.9563 3.8374 3.8450 3.6246 3.8348 4.3061 3.9294 3.9354 3.9499 3.8545 4.2633 4.0043 3.9807 3.9376 3.8522 3.8451 0.9998 1.0066 1.0060 1.0070 0.9971 1.0033 0.9861 1.0167 0.9915 0.9945 0.9952 0.9961 0.9936 0.9967
dispcorr: -0.016286258 hartree
energy: -1388.770158481419
dipole: -6.59104 5.11442 -1.47662 3.74486 -1.93399 1.81087 8.25705 -5.36670 2.89035
magnitude: 3.71669 au
magnitude: 9.44708 debye
