program: Orca
programVersion: 5.0.2
elementType: S O O O O N N C C C C C C C C C C C C C C C H H H H H H H H H H H H H H
charge: 0
multiplicity: 1
keywords: wb97x-d3
keywords: def2-TZVPP
keywords: def2/J RIJCOSX
keywords: DEFGRID2
keywords: scfconv7
keywords: smallprint printgap noloewdin
keywords: NOSOSCF
formula: C15H14N2O4S
InChI: InChI=1/C15H14N2O4S/c1-8-9-5-4-6-10(13(9)14(18)21-8)22-15-16-11(19-2)7-12(17-15)20-3/h4-8H,1-3H3
36 atoms
S  0.418079 2.117886 0.396944
O  -2.162253 -1.479643 1.7776
O  -0.112086 -0.651928 1.992977
O  4.65735 -0.268535 0.352565
O  1.14172 -2.133084 -2.039652
N  2.62409 0.779056 0.309004
N  0.842077 -0.162006 -0.92149
C  -3.400775 -1.176362 1.117144
C  -3.108329 0.104984 0.402173
C  -1.791648 0.448734 0.630061
C  -1.229841 1.586575 0.05735
C  -1.212898 -0.569114 1.520311
C  -3.793362 -2.316641 0.203334
C  -3.933008 0.893954 -0.381794
C  -2.048668 2.37999 -0.73309
C  -3.385353 2.037876 -0.940757
C  1.385175 0.74168 -0.137586
C  3.402448 -0.230078 -0.061201
C  1.627649 -1.173208 -1.269484
C  2.950423 -1.269998 -0.862493
C  5.130931 0.764102 1.210064
C  -0.215326 -2.051123 -2.457453
H  -4.159213 -1.033677 1.891811
H  -3.047361 -2.473133 -0.576687
H  -3.914544 -3.242239 0.766096
H  -4.746532 -2.09162 -0.274755
H  -4.96908 0.63241 -0.554084
H  -1.648779 3.271505 -1.198462
H  -3.999808 2.678086 -1.560099
H  3.584711 -2.097418 -1.147272
H  5.118638 1.73713 0.717627
H  6.158121 0.499408 1.449017
H  4.553182 0.822609 2.132866
H  -0.39975 -2.95238 -3.03711
H  -0.393687 -1.178304 -3.087169
H  -0.901809 -2.025957 -1.609866
elementType: S O N C H
totalener: -1388.75940175 hartree
nucrepener: 1996.00148339 hartree
electener: -3384.76088513 hartree
oneelecener: -5869.08587712 hartree
twoeener: 2484.32499198 hartree
cpcmener: -0.03317901 hartree
kineticenergy: 1384.07523936 hartree
xcener: -112.585735815170 hartree
chargesum: 0.0000000
charge: 0.001158 -0.278945 -0.412377 -0.294812 -0.298342 -0.386496 -0.406797 0.238308 -0.011048 -0.167722 0.056508 0.408415 -0.262731 -0.167891 -0.140487 -0.092758 0.219564 0.434515 0.424568 -0.324669 -0.112496 -0.095196 0.102157 0.096343 0.104985 0.098394 0.152189 0.132722 0.160344 0.140410 0.111222 0.128007 0.111731 0.131448 0.113702 0.086079
qa: 0.0012 -0.2789 -0.4124 -0.2948 -0.2983 -0.3865 -0.4068 0.2383 -0.0110 -0.1677 0.0565 0.4084 -0.2627 -0.1679 -0.1405 -0.0928 0.2196 0.4345 0.4246 -0.3247 -0.1125 -0.0952 0.1022 0.0963 0.1050 0.0984 0.1522 0.1327 0.1603 0.1404 0.1112 0.1280 0.1117 0.1314 0.1137 0.0861
va: 2.4556 2.1461 2.0966 2.1217 2.1225 2.9619 2.9553 3.8588 3.7982 3.6092 3.8401 4.2758 3.9413 3.9377 3.9867 3.8895 4.2732 3.9869 3.9922 3.9493 3.8491 3.8614 0.9986 1.0018 1.0069 1.0070 0.9990 1.0122 0.9877 1.0172 0.9965 0.9936 0.9977 0.9958 0.9973 0.9964
dispcorr: -0.018188837 hartree
energy: -1388.777590585947
dipole: -7.91378 5.17176 -2.74202 -7.05818 7.17720 0.11902 -6.14622 4.52526 -1.62096
magnitude: 3.18753 au
magnitude: 8.10205 debye
