program: Orca
programVersion: 5.0.2
elementType: S O O O O N N C C C C C C C C C C C C C C C H H H H H H H H H H H H H H
charge: 0
multiplicity: 1
keywords: wb97x-d3
keywords: def2-TZVPP
keywords: def2/J RIJCOSX
keywords: DEFGRID2
keywords: scfconv7
keywords: smallprint printgap noloewdin
keywords: NOSOSCF
formula: C15H14N2O4S
InChI: InChI=1/C15H14N2O4S/c1-8-9-5-4-6-10(13(9)14(18)21-8)22-15-16-11(19-2)7-12(17-15)20-3/h4-8H,1-3H3
36 atoms
S  -0.564924 0.311232 2.082253
O  -2.185512 -1.211941 -2.007127
O  -0.99663 -1.91594 -0.268384
O  2.564094 0.206579 -1.757211
O  3.755968 -1.904511 2.207267
N  1.149233 0.260094 0.035861
N  1.741221 -0.834457 2.042617
C  -2.913366 -0.050244 -2.43686
C  -2.715039 0.917731 -1.314058
C  -1.909489 0.332309 -0.358936
C  -1.527336 1.025344 0.787646
C  -1.610018 -1.03675 -0.808693
C  -2.391241 0.436845 -3.77046
C  -3.204836 2.203587 -1.156232
C  -2.011777 2.314932 0.950956
C  -2.848704 2.889527 -0.006515
C  0.936531 -0.13016 1.270891
C  2.29907 -0.125166 -0.503961
C  2.896274 -1.193835 1.497466
C  3.242903 -0.865833 0.192704
C  1.540181 0.838384 -2.520074
C  3.40229 -2.28885 3.531603
H  -3.964184 -0.339307 -2.527425
H  -1.350897 0.756957 -3.700032
H  -2.470587 -0.342587 -4.528265
H  -2.986802 1.286148 -4.105742
H  -3.844894 2.660765 -1.899563
H  -1.735191 2.887391 1.826726
H  -3.212455 3.896112 0.153147
H  4.176713 -1.178304 -0.252672
H  1.254363 1.804691 -2.103688
H  0.656121 0.204371 -2.597886
H  1.961015 0.985907 -3.511811
H  2.497398 -2.896887 3.548845
H  3.265231 -1.424207 4.181735
H  4.237254 -2.881394 3.897375
elementType: S O N C H
totalener: -1388.75960349 hartree
nucrepener: 1995.06033373 hartree
electener: -3383.81993722 hartree
oneelecener: -5867.05963379 hartree
twoeener: 2483.23969657 hartree
cpcmener: -0.03295729 hartree
kineticenergy: 1384.06752084 hartree
xcener: -112.584612294732 hartree
chargesum: 0.0000000
charge: 0.002646 -0.280320 -0.410948 -0.299134 -0.295116 -0.409564 -0.387496 0.227098 -0.004954 -0.159063 0.047166 0.405727 -0.259000 -0.162639 -0.133853 -0.100427 0.227367 0.419568 0.434912 -0.329658 -0.101936 -0.112167 0.102719 0.090641 0.105355 0.101655 0.153371 0.132846 0.161818 0.140975 0.111182 0.096637 0.133549 0.111664 0.110778 0.128602
qa: 0.0026 -0.2803 -0.4109 -0.2991 -0.2951 -0.4096 -0.3875 0.2271 -0.0050 -0.1591 0.0472 0.4057 -0.2590 -0.1626 -0.1339 -0.1004 0.2274 0.4196 0.4349 -0.3297 -0.1019 -0.1122 0.1027 0.0906 0.1054 0.1017 0.1534 0.1328 0.1618 0.1410 0.1112 0.0966 0.1335 0.1117 0.1108 0.1286
va: 2.4644 2.1356 2.0998 2.1233 2.1215 2.9569 2.9618 3.8702 3.7885 3.5835 3.8434 4.2599 3.9278 3.9364 3.9839 3.8958 4.2641 4.0073 3.9881 3.9437 3.8554 3.8486 0.9989 1.0101 1.0080 1.0068 0.9986 1.0118 0.9875 1.0173 0.9952 1.0034 0.9959 0.9974 0.9967 0.9936
dispcorr: -0.018506366 hartree
energy: -1388.778109857169
dipole: -0.89747 -0.46687 -1.36433 5.27174 -2.82760 2.44414 -10.94228 9.45730 -1.48497
magnitude: 3.16865 au
magnitude: 8.05408 debye
