program: Orca
programVersion: 5.0.2
elementType: S O O O O N N C C C C C C C C C C C C C C C H H H H H H H H H H H H H H
charge: 0
multiplicity: 1
keywords: wb97x-d3
keywords: def2-TZVPP
keywords: def2/J RIJCOSX
keywords: DEFGRID2
keywords: scfconv7
keywords: smallprint printgap noloewdin
keywords: NOSOSCF
formula: C15H14N2O4S
InChI: InChI=1/C15H14N2O4S/c1-8-9-5-4-6-10(13(9)14(18)21-8)22-15-16-11(19-2)7-12(17-15)20-3/h4-8H,1-3H3
36 atoms
S  0.499668 1.27953 -1.002924
O  -3.30807 -1.123728 -2.056412
O  -1.284662 -0.630944 -2.86061
O  1.738823 -1.675677 2.771667
O  5.081514 0.05672 0.040155
N  1.199256 -0.304847 1.029675
N  2.894426 0.57878 -0.355284
C  -4.114104 -0.838275 -0.917993
C  -3.238002 0.023796 -0.059431
C  -2.034881 0.211425 -0.712973
C  -1.021265 0.977122 -0.153932
C  -2.094968 -0.52877 -1.995298
C  -5.406879 -0.169747 -1.344854
C  -3.478362 0.588735 1.17783
C  -1.263661 1.558742 1.0848
C  -2.470669 1.359371 1.74336
C  1.640467 0.414473 0.021402
C  2.122851 -0.93497 1.743222
C  3.804279 -0.060352 0.364368
C  3.477648 -0.854691 1.457782
C  0.34974 -1.761184 3.045731
C  5.414362 0.855305 -1.084939
H  -4.335951 -1.787753 -0.418611
H  -5.963708 -0.805373 -2.032144
H  -6.037064 0.016579 -0.47503
H  -5.210946 0.784092 -1.833707
H  -4.418565 0.44561 1.695317
H  -0.498314 2.172938 1.538933
H  -2.62814 1.82446 2.707677
H  4.224709 -1.372286 2.039955
H  -0.080194 -0.786014 3.278103
H  0.261328 -2.413512 3.910814
H  -0.20442 -2.1862 2.208327
H  6.496465 0.80178 -1.172093
H  5.109874 1.893367 -0.949046
H  4.954879 0.478697 -1.99908
totalener: -1388.73592534 hartree
nucrepener: 1936.34285472 hartree
electener: -3325.07878007 hartree
oneelecener: -5748.33924173 hartree
twoeener: 2423.26046167 hartree
kineticenergy: 1384.12154797 hartree
xcener: -112.586971761355 hartree
chargesum: 0.0000000
charge: 0.044474 -0.246174 -0.292507 -0.269550 -0.268038 -0.395651 -0.360654 0.191495 -0.046049 -0.106098 0.055116 0.326253 -0.236932 -0.127863 -0.139037 -0.094023 0.217462 0.385368 0.405032 -0.311758 -0.113918 -0.118224 0.079207 0.101660 0.075517 0.091561 0.123251 0.114002 0.132624 0.124058 0.096074 0.122833 0.104907 0.117828 0.106777 0.110978
qa: 0.0445 -0.2462 -0.2925 -0.2696 -0.2680 -0.3957 -0.3607 0.1915 -0.0460 -0.1061 0.0551 0.3263 -0.2369 -0.1279 -0.1390 -0.0940 0.2175 0.3854 0.4050 -0.3118 -0.1139 -0.1182 0.0792 0.1017 0.0755 0.0916 0.1233 0.1140 0.1326 0.1241 0.0961 0.1228 0.1049 0.1178 0.1068 0.1110
va: 2.4700 2.1651 2.2113 2.1413 2.1401 2.9704 2.9705 3.9179 3.8287 3.6901 3.9164 4.3528 3.9103 3.9646 3.9885 3.9209 4.2569 4.0541 4.0223 3.9396 3.8871 3.8722 0.9927 1.0101 1.0098 1.0122 1.0067 1.0140 0.9981 1.0229 0.9947 0.9946 0.9977 0.9928 0.9988 0.9986
dispcorr: -0.016599217 hartree
energy: -1388.752524561729
dipole: -7.80505 6.67379 -1.13127 -0.96314 1.26781 0.30467 7.78287 -5.92604 1.85683
magnitude: 2.19554 au
magnitude: 5.58063 debye
