program: Orca
programVersion: 4.2.1
elementType: O O O O O O O O N N N N N C C C C C C C C C C C C C C C C C C C C C C C C C C C C C C C C H H H H H H H H H H H H H H H H H H H H H H H H H H H
charge: 0
multiplicity: 1
keywords: wb97x-d3
keywords: def2-TZVPP
keywords: def2/J RIJCOSX GRIDX6 NOFINALGRIDX
keywords: grid4 nofinalgrid
keywords: scfconv7
keywords: smallprint printgap noloewdin
keywords: NOSOSCF
formula: C32H27N5O8
InChI: InChI=1/C32H27N5O8/c1-39-24-18-25(40-2)34-31(33-24)43-22-16-11-17-23(44-32-35-26(41-3)19-27(36-32)42-4)28(22)30(38)45-37-29(20-12-7-5-8-13-20)21-14-9-6-10-15-21/h5-19H,1-4H3
72 atoms
O  -0.13265 -2.107558 1.687132
O  3.645523 -0.468539 -0.837761
O  -0.296658 -0.882576 -0.765285
O  1.211506 0.774317 -0.872308
O  -4.309321 -0.646174 2.468342
O  4.15188 2.859217 2.227179
O  -0.817829 2.394699 2.140281
O  4.837563 3.630851 -2.306963
N  -1.201086 0.007696 -1.30667
N  -2.184055 -1.39018 2.09322
N  3.929516 1.159429 0.723973
N  -0.402543 0.151333 1.952628
N  4.259185 1.544244 -1.58019
C  1.712823 -1.198572 0.370273
C  -2.304309 -0.543474 -1.633943
C  -2.640805 -1.980464 -1.560063
C  -3.331171 0.405469 -2.11732
C  1.19664 -2.00521 1.391181
C  3.094618 -1.232074 0.161629
C  2.024759 -2.821292 2.142839
C  3.926268 -2.062097 0.886098
C  3.3821 -2.862196 1.875407
C  0.879424 -0.302091 -0.468562
C  -3.860774 -2.349914 -0.996095
C  -3.406969 1.695378 -1.59014
C  -1.791076 -2.968002 -2.055465
C  -4.213428 0.030649 -3.129902
C  -4.21926 -3.685688 -0.91045
C  -4.343469 2.594012 -2.074861
C  -2.159849 -4.302343 -1.982094
C  -5.143461 0.935975 -3.618258
C  -3.368777 -4.664898 -1.403665
C  -5.211108 2.218623 -3.092404
C  -0.927923 -1.050207 1.918394
C  3.952806 0.80728 -0.537633
C  -3.02789 -0.384017 2.271615
C  4.190574 2.434257 0.973645
C  -1.263426 1.151262 2.113424
C  4.526468 2.815311 -1.313521
C  -2.627302 0.945983 2.265975
C  4.493188 3.344493 -0.027524
C  -4.708362 -2.001281 2.649723
C  3.995015 1.892571 3.263081
C  0.588866 2.62605 2.146027
C  4.853598 3.116247 -3.634736
H  1.597373 -3.43048 2.927557
H  4.987686 -2.073478 0.678365
H  4.022418 -3.512486 2.455655
H  -4.534639 -1.59103 -0.618158
H  -2.739591 1.991902 -0.791476
H  -0.852152 -2.703597 -2.522485
H  -4.167592 -0.964937 -3.552201
H  -5.166641 -3.960758 -0.465371
H  -4.398581 3.589614 -1.654368
H  -1.498819 -5.061002 -2.379747
H  -5.815124 0.637214 -4.412315
H  -3.650543 -5.708139 -1.344358
H  -5.940596 2.922835 -3.471033
H  -3.3231 1.761063 2.401068
H  4.702715 4.384579 0.175548
H  -4.467182 -2.62151 1.788436
H  -5.785827 -1.975111 2.78539
H  -4.247301 -2.437524 3.536078
H  3.131311 1.248862 3.104502
H  3.865368 2.460333 4.180771
H  4.883142 1.265069 3.352248
H  0.708921 3.706245 2.129821
H  1.075193 2.194793 1.273765
H  1.04297 2.230337 3.054471
H  5.598335 2.329175 -3.755941
H  5.116107 3.956807 -4.272082
H  3.87738 2.732379 -3.931505
elementType: O N C H
totalener: -2111.36880610 hartree
nucrepener: 5748.23593709 hartree
electener: -7859.60474319 hartree
twoeener: 6467.07878545 hartree
cpcmener: -0.04334641 hartree
kineticenergy: 2102.89547072 hartree
xcener: -199.174044830784 hartree
chargesum: -0.0000000
charge: -0.282303 -0.310053 -0.163276 -0.377064 -0.298866 -0.299271 -0.304785 -0.297808 -0.135138 -0.362667 -0.364255 -0.380010 -0.385045 -0.043850 0.309878 0.107301 0.030624 0.197982 0.279520 -0.200111 -0.206284 -0.100440 0.425470 -0.294744 -0.212544 -0.167655 -0.173330 -0.151311 -0.163421 -0.164578 -0.169288 -0.140341 -0.133358 0.337116 0.360640 0.432920 0.362132 0.428343 0.423511 -0.359498 -0.325174 -0.117993 -0.126994 -0.113127 -0.114859 0.152116 0.147211 0.162612 0.162157 0.155070 0.139376 0.153609 0.164372 0.158656 0.159076 0.158854 0.161152 0.160402 0.139054 0.141391 0.099301 0.133567 0.122231 0.099642 0.139302 0.124438 0.138241 0.100193 0.118436 0.111499 0.129400 0.112643
qa: -0.2823 -0.3101 -0.1633 -0.3771 -0.2989 -0.2993 -0.3048 -0.2978 -0.1351 -0.3627 -0.3643 -0.3800 -0.3850 -0.0438 0.3099 0.1073 0.0306 0.1980 0.2795 -0.2001 -0.2063 -0.1004 0.4255 -0.2947 -0.2125 -0.1677 -0.1733 -0.1513 -0.1634 -0.1646 -0.1693 -0.1403 -0.1334 0.3371 0.3606 0.4329 0.3621 0.4283 0.4235 -0.3595 -0.3252 -0.1180 -0.1270 -0.1131 -0.1149 0.1521 0.1472 0.1626 0.1622 0.1551 0.1394 0.1536 0.1644 0.1587 0.1591 0.1589 0.1612 0.1604 0.1391 0.1414 0.0993 0.1336 0.1222 0.0996 0.1393 0.1244 0.1382 0.1002 0.1184 0.1115 0.1294 0.1126
va: 2.1189 2.0994 2.1261 2.1001 2.1098 2.0953 2.1130 2.1210 2.7946 2.9365 2.8885 2.9296 2.9373 3.6823 3.6148 3.3800 3.5042 3.8587 3.7208 3.9733 3.9965 3.9021 4.0976 3.9679 4.0013 3.9361 3.9335 3.8900 3.9429 3.9105 3.9165 3.9125 3.8907 4.3215 4.3029 3.9351 4.0416 3.9459 4.0028 3.9189 3.9431 3.8551 3.8498 3.8572 3.8504 1.0034 1.0022 0.9861 0.9906 1.0033 1.0182 0.9978 0.9898 0.9930 0.9914 0.9926 0.9879 0.9890 1.0192 1.0172 0.9894 0.9934 0.9989 0.9936 0.9892 0.9974 0.9952 0.9999 0.9940 0.9964 0.9934 0.9975
dispcorr: -0.047524741 hartree
energy: -2111.416330840961
dipole: -10.80896 9.90704 -0.90192 1.46175 -2.90924 -1.44748 0.93889 0.18201 1.12090
magnitude: 2.04085 au
magnitude: 5.18744 debye
