program: Orca
programVersion: 4.2.1
elementType: S O O O O O O O N N N N C C C C C C C C C C C C C C C H H H H H H H H H H H H H H H H H H
charge: 0
multiplicity: 1
keywords: wb97x-d3
keywords: def2-TZVPP
keywords: def2/J RIJCOSX GRIDX6 NOFINALGRIDX
keywords: grid4 nofinalgrid
keywords: scfconv7
keywords: smallprint printgap noloewdin
keywords: NOSOSCF
formula: C15H18N4O7S
InChI: InChI=1/C15H18N4O7S/c1-4-9-26-14-16-19(15(22)18(14)2)13(21)17-27(23,24)11-8-6-5-7-10(11)12(20)25-3/h5-8,17H,4,9H2,1-3H3
45 atoms
S  -2.467989 0.723218 -0.893809
O  4.724101 -0.068593 -1.094157
O  -2.848615 0.501889 -2.271229
O  -3.083351 1.800148 -0.142085
O  1.218744 2.58761 0.095651
O  -0.17307 -0.840673 -1.884544
O  -1.374482 0.953286 2.06848
O  -3.333403 0.701681 3.117181
N  3.217977 1.486256 -0.348519
N  1.407793 0.554589 -1.045509
N  -0.832472 1.066795 -0.841345
N  2.42803 -0.286039 -1.427517
C  -2.671744 -0.796032 -0.003174
C  3.480457 0.306436 -0.989663
C  -2.738298 -0.814809 1.392419
C  1.868913 1.667814 -0.36847
C  0.09862 0.18193 -1.308297
C  5.023094 -1.347833 -1.703194
C  -2.886115 -1.947708 -0.745255
C  5.297128 -2.400557 -0.653624
C  4.1861 2.386747 0.240531
C  -3.025196 -2.016013 2.025565
C  -3.144377 -3.143259 -0.092873
C  -3.212601 -3.176791 1.289217
C  -2.536944 0.372763 2.274959
C  4.115364 -2.738467 0.242008
C  -1.077684 2.127344 2.833575
H  -0.540966 1.887884 -0.308394
H  5.909788 -1.167517 -2.307849
H  4.211356 -1.641997 -2.368706
H  -2.864125 -1.924608 -1.824435
H  5.61192 -3.293302 -1.199864
H  6.154884 -2.096493 -0.049043
H  4.737512 1.889183 1.034066
H  4.877121 2.750692 -0.515279
H  3.655817 3.233837 0.663875
H  -3.089245 -2.050027 3.104643
H  -3.302889 -4.04198 -0.671892
H  -3.421531 -4.105557 1.801377
H  3.244381 -3.042683 -0.339165
H  4.371038 -3.562261 0.908747
H  3.821249 -1.898936 0.873563
H  -0.097147 2.455626 2.505309
H  -1.045741 1.904581 3.898689
H  -1.806929 2.913846 2.644544
elementType: S O N C H
totalener: -1726.39624827 hartree
nucrepener: 2892.93787524 hartree
electener: -4619.33412351 hartree
oneelecener: -8118.29498916 hartree
twoeener: 3498.96086565 hartree
cpcmener: -0.05649102 hartree
kineticenergy: 1720.17950276 hartree
xcener: -141.513722834302 hartree
chargesum: 0.0000000
charge: 0.889820 -0.313170 -0.499208 -0.512622 -0.516276 -0.443317 -0.273363 -0.449160 -0.117040 0.042012 -0.200100 -0.366111 -0.159717 0.418274 0.083518 0.415870 0.370019 0.028959 0.005624 -0.086173 -0.159043 -0.194814 -0.167155 -0.105622 0.470550 -0.278661 -0.126226 0.217244 0.120265 0.106056 0.146327 0.072353 0.068754 0.131136 0.130939 0.113366 0.150664 0.169368 0.170215 0.085879 0.099848 0.083130 0.122046 0.129510 0.126034
qa: 0.8898 -0.3132 -0.4992 -0.5126 -0.5163 -0.4433 -0.2734 -0.4492 -0.1170 0.0420 -0.2001 -0.3661 -0.1597 0.4183 0.0835 0.4159 0.3700 0.0290 0.0056 -0.0862 -0.1590 -0.1948 -0.1672 -0.1056 0.4706 -0.2787 -0.1262 0.2172 0.1203 0.1061 0.1463 0.0724 0.0688 0.1311 0.1309 0.1134 0.1507 0.1694 0.1702 0.0859 0.0998 0.0831 0.1220 0.1295 0.1260
va: 5.7951 2.1357 2.0034 1.9760 1.9921 2.0771 2.1164 2.0515 3.3278 3.1945 3.1405 2.8026 3.8335 4.1428 3.6898 4.2457 4.4133 3.8311 3.8302 3.8966 3.8624 4.0218 3.9565 3.9026 4.0885 3.9313 3.8364 1.0438 0.9966 1.0097 1.0239 1.0131 1.0116 0.9908 0.9905 1.0135 1.0081 0.9867 0.9850 1.0062 1.0041 1.0003 1.0041 0.9956 0.9935
dispcorr: -0.024653265 hartree
energy: -1726.420901532158
dipole: 28.82964 -23.70527 5.12437 -11.18745 9.64407 -1.54338 8.24569 -6.82969 1.41600
magnitude: 5.53590 au
magnitude: 14.07115 debye
