program: Orca
programVersion: 4.2.1
elementType: S O O O O O O O N N N N C C C C C C C C C C C C C C C H H H H H H H H H H H H H H H H H H
charge: 0
multiplicity: 1
keywords: wb97x-d3
keywords: def2-TZVPP
keywords: def2/J RIJCOSX GRIDX6 NOFINALGRIDX
keywords: grid4 nofinalgrid
keywords: scfconv7
keywords: smallprint printgap noloewdin
keywords: NOSOSCF
formula: C15H18N4O7S
InChI: InChI=1/C15H18N4O7S/c1-4-9-26-14-16-19(15(22)18(14)2)13(21)17-27(23,24)11-8-6-5-7-10(11)12(20)25-3/h5-8,17H,4,9H2,1-3H3
45 atoms
S  -2.33962 0.568508 -1.058893
O  4.812449 -0.375426 -0.449343
O  -2.580515 0.08802 -2.401171
O  -2.982711 1.785882 -0.602762
O  1.296091 2.489825 0.013619
O  -0.031276 -1.213064 -1.452367
O  -3.519139 1.381437 2.692795
O  -1.396792 1.366967 1.983309
N  3.29977 1.316376 -0.112132
N  1.51187 0.274635 -0.707025
N  -0.706941 0.880526 -0.884764
N  2.537586 -0.628655 -0.864486
C  -2.697618 -0.732334 0.086856
C  3.57538 0.034511 -0.499452
C  -2.828118 -0.457573 1.449417
C  1.955167 1.496856 -0.234473
C  0.224347 -0.106464 -1.049511
C  5.087072 -1.737463 -0.842609
C  -2.946503 -1.997824 -0.419367
C  5.13057 -1.911742 -2.346026
C  4.248714 2.302989 0.358228
C  -3.211855 -1.484745 2.299185
C  -3.311205 -3.016848 0.447481
C  -3.442254 -2.760202 1.801497
C  -2.492863 0.869771 2.0479
C  5.4669 -3.354145 -2.696599
C  -3.315001 2.629971 3.366504
H  -0.447245 1.759661 -0.433448
H  4.352648 -2.400878 -0.381078
H  6.058789 -1.95108 -0.40111
H  -2.868085 -2.197639 -1.477724
H  4.169924 -1.64303 -2.78822
H  5.881307 -1.240173 -2.76792
H  3.712048 3.220344 0.578537
H  4.739264 1.95898 1.265147
H  4.992731 2.509877 -0.406619
H  -3.318522 -1.297629 3.35904
H  -3.499758 -4.006477 0.056138
H  -3.730056 -3.551704 2.479307
H  4.717751 -4.045016 -2.306647
H  5.506156 -3.488933 -3.776959
H  6.435788 -3.650904 -2.291962
H  -4.271233 2.884371 3.81218
H  -3.022834 3.410689 2.665641
H  -2.562287 2.536961 4.147815
elementType: S O N C H
totalener: -1726.39754230 hartree
nucrepener: 2842.77371432 hartree
electener: -4569.17125662 hartree
oneelecener: -8019.48313588 hartree
twoeener: 3450.31187926 hartree
cpcmener: -0.05687343 hartree
kineticenergy: 1720.17839986 hartree
xcener: -141.512154890910 hartree
chargesum: 0.0000000
charge: 0.887711 -0.314449 -0.499019 -0.512230 -0.510334 -0.441871 -0.271630 -0.440019 -0.121196 0.040498 -0.201848 -0.379491 -0.129823 0.439938 0.068594 0.410301 0.361006 0.038857 -0.009726 -0.112032 -0.161903 -0.188468 -0.165833 -0.103905 0.455086 -0.277173 -0.122639 0.220658 0.101263 0.125438 0.149239 0.078673 0.072541 0.113900 0.131410 0.132458 0.151117 0.170449 0.169605 0.087759 0.095535 0.084831 0.134746 0.118611 0.123367
qa: 0.8877 -0.3144 -0.4990 -0.5122 -0.5103 -0.4419 -0.2716 -0.4400 -0.1212 0.0405 -0.2018 -0.3795 -0.1298 0.4399 0.0686 0.4103 0.3610 0.0389 -0.0097 -0.1120 -0.1619 -0.1885 -0.1658 -0.1039 0.4551 -0.2772 -0.1226 0.2207 0.1013 0.1254 0.1492 0.0787 0.0725 0.1139 0.1314 0.1325 0.1511 0.1704 0.1696 0.0878 0.0955 0.0848 0.1347 0.1186 0.1234
va: 5.8001 2.1446 2.0019 1.9753 2.0001 2.0777 2.1427 2.0502 3.3339 3.1870 3.1387 2.7862 3.7782 4.1186 3.7065 4.2616 4.4255 3.8049 3.8405 3.8687 3.8607 4.0263 3.9522 3.8941 4.0859 3.9458 3.8506 1.0420 1.0102 0.9953 1.0206 1.0225 1.0110 1.0129 0.9906 0.9907 1.0074 0.9860 0.9853 1.0008 1.0020 1.0016 0.9934 0.9946 0.9924
dispcorr: -0.022698844 hartree
energy: -1726.420241145110
dipole: 25.56715 -22.76195 2.80520 -10.35339 9.18152 -1.17188 2.40413 0.36393 2.76806
magnitude: 4.11152 au
magnitude: 10.45065 debye
