program: Orca
programVersion: 4.2.1
elementType: S O O O O O O O N N N N C C C C C C C C C C C C C C C H H H H H H H H H H H H H H H H H H
charge: 0
multiplicity: 1
keywords: wb97x-d3
keywords: def2-TZVPP
keywords: def2/J RIJCOSX GRIDX6 NOFINALGRIDX
keywords: grid4 nofinalgrid
keywords: scfconv7
keywords: smallprint printgap noloewdin
keywords: NOSOSCF
formula: C15H18N4O7S
InChI: InChI=1/C15H18N4O7S/c1-4-9-26-14-16-19(15(22)18(14)2)13(21)17-27(23,24)11-8-6-5-7-10(11)12(20)25-3/h5-8,17H,4,9H2,1-3H3
45 atoms
S  -2.074318 0.695166 1.719337
O  4.765158 -0.162841 -0.437716
O  -2.845972 1.833625 1.257562
O  -2.094347 0.330723 3.11857
O  1.193657 2.653798 -0.135935
O  0.344963 -0.974919 1.79743
O  -3.689214 1.099634 -1.939234
O  -1.49791 1.174048 -1.490693
N  3.175638 1.490258 -0.483881
N  1.637826 0.493072 0.645881
N  -0.503392 1.068636 1.28464
N  2.685813 -0.396206 0.579751
C  -2.518618 -0.722863 0.75578
C  3.571587 0.239613 -0.099475
C  -2.818904 -0.592276 -0.601335
C  1.911513 1.678665 -0.012977
C  0.472125 0.11041 1.28912
C  5.141408 -1.515123 -0.0977
C  -2.670225 -1.933591 1.412138
C  4.568497 -2.527864 -1.066546
C  3.946913 2.447395 -1.248248
C  -3.274071 -1.706772 -1.2908
C  -3.11032 -3.04114 0.7035
C  -3.410614 -2.926978 -0.643073
C  -2.584421 0.66547 -1.372457
C  5.027076 -3.931042 -0.697375
C  -3.588954 2.266194 -2.766052
H  -0.371951 1.921442 0.736329
H  4.845755 -1.727225 0.931611
H  6.228928 -1.508981 -0.141395
H  -2.456685 -2.023141 2.466978
H  3.477755 -2.48649 -1.058178
H  4.894118 -2.28369 -2.07987
H  3.350627 3.344926 -1.378229
H  4.860034 2.709461 -0.720103
H  4.190875 2.045392 -2.22812
H  -3.510339 -1.631064 -2.343546
H  -3.222802 -3.988319 1.211648
H  -3.757487 -3.787794 -1.197472
H  6.11469 -4.015701 -0.713688
H  4.685937 -4.21364 0.299626
H  4.629957 -4.662906 -1.399865
H  -4.594496 2.46017 -3.124903
H  -2.927445 2.092082 -3.613203
H  -3.236125 3.123157 -2.194331
elementType: S O N C H
totalener: -1726.39734708 hartree
nucrepener: 2866.35827049 hartree
electener: -4592.75561757 hartree
oneelecener: -8066.59345483 hartree
twoeener: 3473.83783725 hartree
cpcmener: -0.05655660 hartree
kineticenergy: 1720.18042625 hartree
xcener: -141.511961513533 hartree
chargesum: -0.0000000
charge: 0.889555 -0.314466 -0.511460 -0.500668 -0.508084 -0.438544 -0.272175 -0.437820 -0.121264 0.041246 -0.204439 -0.376469 -0.128580 0.435797 0.070932 0.409928 0.353725 0.042621 -0.015716 -0.110781 -0.160853 -0.187382 -0.164440 -0.105721 0.455307 -0.276340 -0.124244 0.220159 0.100936 0.124553 0.150863 0.077112 0.072101 0.113796 0.131299 0.132714 0.151670 0.169958 0.169938 0.084643 0.087571 0.095085 0.134809 0.123364 0.119766
qa: 0.8896 -0.3145 -0.5115 -0.5007 -0.5081 -0.4385 -0.2722 -0.4378 -0.1213 0.0412 -0.2044 -0.3765 -0.1286 0.4358 0.0709 0.4099 0.3537 0.0426 -0.0157 -0.1108 -0.1609 -0.1874 -0.1644 -0.1057 0.4553 -0.2763 -0.1242 0.2202 0.1009 0.1246 0.1509 0.0771 0.0721 0.1138 0.1313 0.1327 0.1517 0.1700 0.1699 0.0846 0.0876 0.0951 0.1348 0.1234 0.1198
va: 5.7981 2.1454 1.9765 1.9984 2.0036 2.0806 2.1435 2.0530 3.3343 3.1869 3.1328 2.7888 3.7747 4.1254 3.7020 4.2619 4.4307 3.8061 3.8413 3.8767 3.8604 4.0258 3.9508 3.8927 4.0833 3.9467 3.8510 1.0437 1.0095 0.9953 1.0192 1.0209 1.0112 1.0133 0.9906 0.9907 1.0071 0.9861 0.9851 1.0012 1.0012 1.0019 0.9936 0.9923 0.9941
dispcorr: -0.023076722 hartree
energy: -1726.420423805850
dipole: 21.73804 -19.50530 2.23274 -13.73001 12.25674 -1.47327 -16.92237 13.24960 -3.67277
magnitude: 4.54366 au
magnitude: 11.54907 debye
