program: Orca
programVersion: 4.2.1
elementType: S O O O O O O O N N N N C C C C C C C C C C C C C C C H H H H H H H H H H H H H H H H H H
charge: 0
multiplicity: 1
keywords: wb97x-d3
keywords: def2-TZVPP
keywords: def2/J RIJCOSX GRIDX6 NOFINALGRIDX
keywords: grid4 nofinalgrid
keywords: scfconv7
keywords: smallprint printgap noloewdin
keywords: NOSOSCF
formula: C15H18N4O7S
InChI: InChI=1/C15H18N4O7S/c1-4-9-26-14-16-19(15(22)18(14)2)13(21)17-27(23,24)11-8-6-5-7-10(11)12(20)25-3/h5-8,17H,4,9H2,1-3H3
45 atoms
S  -1.898114 1.181541 0.336839
O  4.985917 -0.479956 -1.049791
O  -2.177631 1.270066 -1.0830
O  -2.269518 2.266001 1.222168
O  2.101811 2.272068 1.157891
O  -0.014368 -0.755342 -0.827972
O  -4.850144 0.985379 -0.216738
O  -4.876777 -0.71478 -1.675825
N  3.839948 1.101399 0.151734
N  1.849948 0.322143 -0.110838
N  -0.247246 1.032263 0.553402
N  2.678801 -0.540442 -0.792907
C  -2.528081 -0.3629 0.943776
C  3.845802 -0.036028 -0.606768
C  -3.670814 -0.918088 0.368315
C  2.546193 1.35714 0.488944
C  0.480201 0.134199 -0.184222
C  4.97032 -1.702908 -1.817439
C  -1.85337 -1.011939 1.964696
C  6.388331 -2.018002 -2.223785
C  4.990234 1.894237 0.52978
C  -4.093907 -2.168071 0.797573
C  -2.309952 -2.245008 2.40547
C  -3.418525 -2.827729 1.813591
C  -4.510626 -0.214619 -0.642813
C  7.330621 -2.254976 -1.053817
C  -5.594167 1.820317 -1.108844
H  0.220207 1.778952 1.072033
H  4.332115 -1.565555 -2.69214
H  4.548438 -2.500476 -1.20137
H  -0.96579 -0.584627 2.410581
H  6.333625 -2.916142 -2.842957
H  6.770147 -1.224508 -2.870496
H  5.496371 2.275207 -0.353378
H  4.649249 2.734929 1.125366
H  5.682307 1.303295 1.124098
H  -4.971624 -2.618014 0.353634
H  -1.78533 -2.751404 3.203172
H  -3.765351 -3.796678 2.144284
H  7.462499 -1.360348 -0.445171
H  6.962858 -3.05008 -0.402895
H  8.31682 -2.552116 -1.410043
H  -5.053458 1.98324 -2.040226
H  -5.719102 2.767233 -0.593447
H  -6.57231 1.392353 -1.323081
elementType: S O N C H
totalener: -1726.39735546 hartree
nucrepener: 2787.94123238 hartree
electener: -4514.33858784 hartree
oneelecener: -7908.96255246 hartree
twoeener: 3394.62396461 hartree
cpcmener: -0.06424698 hartree
kineticenergy: 1720.17691168 hartree
xcener: -141.511025864263 hartree
chargesum: 0.0000000
charge: 0.891199 -0.303644 -0.496006 -0.509170 -0.513541 -0.434818 -0.267383 -0.451667 -0.119104 0.047407 -0.227854 -0.383837 -0.150427 0.436887 0.113280 0.419862 0.365023 0.011481 -0.032037 -0.097195 -0.159524 -0.207738 -0.172877 -0.090443 0.470907 -0.256993 -0.128524 0.218079 0.118768 0.109504 0.155332 0.071628 0.068782 0.132622 0.113963 0.129431 0.151604 0.169376 0.169857 0.082396 0.080342 0.093476 0.120098 0.133519 0.127960
qa: 0.8912 -0.3036 -0.4960 -0.5092 -0.5135 -0.4348 -0.2674 -0.4517 -0.1191 0.0474 -0.2279 -0.3838 -0.1504 0.4369 0.1133 0.4199 0.3650 0.0115 -0.0320 -0.0972 -0.1595 -0.2077 -0.1729 -0.0904 0.4709 -0.2570 -0.1285 0.2181 0.1188 0.1095 0.1553 0.0716 0.0688 0.1326 0.1140 0.1294 0.1516 0.1694 0.1699 0.0824 0.0803 0.0935 0.1201 0.1335 0.1280
va: 5.7632 2.1481 1.9825 1.9687 1.9972 2.0807 2.1246 2.0499 3.3290 3.1747 3.1516 2.7945 3.8088 4.1332 3.6149 4.2520 4.4196 3.8203 3.8296 3.9322 3.8605 4.0362 3.9499 3.8828 4.0967 3.9201 3.8462 1.0412 1.0016 0.9993 1.0042 1.0110 1.0134 0.9905 1.0133 0.9908 1.0078 0.9869 0.9848 1.0073 1.0024 1.0043 0.9960 0.9938 0.9936
dispcorr: -0.022086064 hartree
energy: -1726.419441524540
dipole: 29.85961 -25.85639 4.00321 -10.17486 8.99455 -1.18031 -3.80478 5.56930 1.76452
magnitude: 4.53127 au
magnitude: 11.51757 debye
