program: Orca
programVersion: 4.2.1
elementType: S O O O O O O O N N N N C C C C C C C C C C C C C C C H H H H H H H H H H H H H H H H H H
charge: 0
multiplicity: 1
keywords: wb97x-d3
keywords: def2-TZVPP
keywords: def2/J RIJCOSX GRIDX6 NOFINALGRIDX
keywords: grid4 nofinalgrid
keywords: scfconv7
keywords: smallprint printgap noloewdin
keywords: NOSOSCF
formula: C15H18N4O7S
InChI: InChI=1/C15H18N4O7S/c1-4-9-26-14-16-19(15(22)18(14)2)13(21)17-27(23,24)11-8-6-5-7-10(11)12(20)25-3/h5-8,17H,4,9H2,1-3H3
45 atoms
S  -2.009449 -0.04209 1.699651
O  4.635601 -0.313525 -1.176949
O  -2.668632 1.227948 1.934233
O  -1.886127 -0.994584 2.780415
O  1.288263 2.304258 0.468189
O  0.219713 -1.74172 0.749799
O  -2.088404 1.821148 -0.861367
O  -4.311465 2.056309 -0.944621
N  3.179584 1.28658 -0.421847
N  1.587286 -0.004133 0.234565
N  -0.477146 0.379303 1.182655
N  2.567971 -0.841041 -0.246436
C  -2.778161 -0.849599 0.322328
C  3.489695 -0.030044 -0.625473
C  -3.376461 -0.1135 -0.703288
C  1.938765 1.329016 0.135211
C  0.415075 -0.553221 0.733009
C  4.975266 -1.704898 -1.370274
C  -2.871383 -2.232479 0.360268
C  5.41697 -2.382879 -0.091479
C  4.002254 2.432245 -0.746256
C  -4.076379 -0.796693 -1.687556
C  -3.547197 -2.898991 -0.650098
C  -4.148833 -2.182268 -1.670109
C  -3.325879 1.373918 -0.825423
C  6.572009 -1.681511 0.60565
C  -1.898975 3.238518 -0.940749
H  -0.272235 1.374914 1.076252
H  5.789272 -1.674974 -2.092199
H  4.131503 -2.221974 -1.830129
H  -2.433436 -2.795743 1.17057
H  4.573504 -2.498822 0.591195
H  5.715556 -3.394119 -0.379083
H  4.950033 2.383032 -0.216465
H  4.181796 2.483452 -1.816999
H  3.478554 3.33115 -0.43689
H  -4.555426 -0.244749 -2.484832
H  -3.61067 -3.977587 -0.625905
H  -4.685043 -2.697927 -2.454493
H  7.42335 -1.550433 -0.064836
H  6.288235 -0.697145 0.979761
H  6.914192 -2.264329 1.460731
H  -2.335121 3.643665 -1.852338
H  -0.825267 3.393801 -0.956022
H  -2.326872 3.740917 -0.074039
elementType: S O N C H
totalener: -1726.39752723 hartree
nucrepener: 2868.85187183 hartree
electener: -4595.24939906 hartree
oneelecener: -8070.11071259 hartree
twoeener: 3474.86131353 hartree
cpcmener: -0.05630628 hartree
kineticenergy: 1720.18286214 hartree
xcener: -141.514287436932 hartree
chargesum: 0.0000000
charge: 0.887811 -0.314283 -0.512046 -0.498600 -0.515635 -0.442682 -0.273234 -0.448385 -0.121710 0.044170 -0.200033 -0.377072 -0.156139 0.431280 0.082676 0.416441 0.369001 0.036847 0.004594 -0.134167 -0.156804 -0.196555 -0.166766 -0.103841 0.468095 -0.262652 -0.127027 0.216892 0.123796 0.113329 0.146352 0.079748 0.084292 0.128753 0.132117 0.113499 0.151702 0.168637 0.169557 0.082845 0.081231 0.095871 0.128284 0.123276 0.126534
qa: 0.8878 -0.3143 -0.5120 -0.4986 -0.5156 -0.4427 -0.2732 -0.4484 -0.1217 0.0442 -0.2000 -0.3771 -0.1561 0.4313 0.0827 0.4164 0.3690 0.0368 0.0046 -0.1342 -0.1568 -0.1966 -0.1668 -0.1038 0.4681 -0.2627 -0.1270 0.2169 0.1238 0.1133 0.1464 0.0797 0.0843 0.1288 0.1321 0.1135 0.1517 0.1686 0.1696 0.0828 0.0812 0.0959 0.1283 0.1233 0.1265
va: 5.7975 2.1293 1.9763 2.0043 1.9927 2.0782 2.1145 2.0524 3.3349 3.1881 3.1402 2.7972 3.8299 4.1388 3.6963 4.2448 4.4156 3.8064 3.8326 3.8796 3.8627 4.0214 3.9557 3.9004 4.0923 3.9286 3.8360 1.0463 0.9913 1.0121 1.0242 1.0174 1.0103 0.9914 0.9902 1.0134 1.0075 0.9870 0.9852 1.0013 1.0064 1.0042 0.9965 1.0034 0.9934
dispcorr: -0.024217453 hartree
energy: -1726.421744684606
dipole: 30.56112 -26.50097 4.06015 -3.00746 2.81461 -0.19285 -10.07742 6.58466 -3.49276
magnitude: 5.35924 au
magnitude: 13.62210 debye
