program: Orca
programVersion: 4.2.1
elementType: S O O O O O O O N N N N C C C C C C C C C C C C C C C H H H H H H H H H H H H H H H H H H
charge: 0
multiplicity: 1
keywords: wb97x-d3
keywords: def2-TZVPP
keywords: def2/J RIJCOSX GRIDX6 NOFINALGRIDX
keywords: grid4 nofinalgrid
keywords: scfconv7
keywords: smallprint printgap noloewdin
keywords: NOSOSCF
formula: C15H18N4O7S
InChI: InChI=1/C15H18N4O7S/c1-4-9-26-14-16-19(15(22)18(14)2)13(21)17-27(23,24)11-8-6-5-7-10(11)12(20)25-3/h5-8,17H,4,9H2,1-3H3
45 atoms
S  -2.48816 0.744978 -1.087475
O  4.626019 -0.470383 -0.682853
O  -2.830347 0.381187 -2.444465
O  -3.070817 1.930616 -0.488083
O  1.229762 2.507178 -0.057854
O  -0.249365 -1.064182 -1.694403
O  -3.288328 1.237905 2.834406
O  -1.248939 1.214688 1.914293
N  3.183131 1.259674 -0.239244
N  1.358426 0.328468 -0.902315
N  -0.84094 1.017166 -1.003645
N  2.347561 -0.605945 -1.108291
C  -2.800413 -0.642823 -0.032321
C  3.408176 -0.007168 -0.699996
C  -2.808535 -0.491913 1.355556
C  1.848016 1.502296 -0.357263
C  0.052635 0.00987 -1.238906
C  4.819631 -1.826776 -1.135632
C  -3.146419 -1.845461 -0.626849
C  6.297386 -2.131206 -1.084758
C  4.171042 2.180755 0.280793
C  -3.172155 -1.577967 2.138564
C  -3.488915 -2.925728 0.172063
C  -3.502169 -2.79104 1.549693
C  -2.355763 0.754942 2.041942
C  6.557998 -3.565463 -1.520535
C  -2.957665 2.400596 3.604787
H  -0.538428 1.860155 -0.511587
H  4.433752 -1.923803 -2.152618
H  4.254164 -2.499149 -0.486329
H  -3.159601 -1.949416 -1.701563
H  6.836478 -1.440792 -1.737025
H  6.670554 -1.978781 -0.069741
H  3.672452 3.107073 0.547958
H  4.645675 1.770702 1.168438
H  4.92402 2.395531 -0.472971
H  -3.184613 -1.486687 3.216092
H  -3.752697 -3.866696 -0.289383
H  -3.772857 -3.630123 2.175252
H  6.065248 -4.279894 -0.859627
H  6.199015 -3.74843 -2.534423
H  7.624752 -3.785112 -1.50546
H  -2.697752 3.238143 2.958996
H  -2.136847 2.197179 4.290822
H  -3.85148 2.644019 4.170036
elementType: S O N C H
totalener: -1726.39896778 hartree
nucrepener: 2830.65438027 hartree
electener: -4557.05334805 hartree
oneelecener: -7995.12263069 hartree
twoeener: 3438.06928264 hartree
cpcmener: -0.05750313 hartree
kineticenergy: 1720.18264739 hartree
xcener: -141.511420727179 hartree
chargesum: -0.0000000
charge: 0.889325 -0.305024 -0.500166 -0.512937 -0.508652 -0.439195 -0.272523 -0.438116 -0.117990 0.051684 -0.201503 -0.383530 -0.127469 0.429797 0.070369 0.413216 0.353327 0.026789 -0.013604 -0.078262 -0.161580 -0.187904 -0.164684 -0.104822 0.453683 -0.279808 -0.122361 0.219400 0.103947 0.106533 0.149626 0.070881 0.069282 0.113884 0.131613 0.132204 0.151098 0.170528 0.169989 0.085911 0.084832 0.095536 0.119315 0.122932 0.134432
qa: 0.8893 -0.3050 -0.5002 -0.5129 -0.5087 -0.4392 -0.2725 -0.4381 -0.1180 0.0517 -0.2015 -0.3835 -0.1275 0.4298 0.0704 0.4132 0.3533 0.0268 -0.0136 -0.0783 -0.1616 -0.1879 -0.1647 -0.1048 0.4537 -0.2798 -0.1224 0.2194 0.1039 0.1065 0.1496 0.0709 0.0693 0.1139 0.1316 0.1322 0.1511 0.1705 0.1700 0.0859 0.0848 0.0955 0.1193 0.1229 0.1344
va: 5.7979 2.1467 1.9998 1.9746 2.0023 2.0802 2.1436 2.0530 3.3336 3.1650 3.1360 2.7920 3.7752 4.1362 3.6991 4.2575 4.4342 3.8219 3.8432 3.9053 3.8596 4.0262 3.9522 3.8950 4.0862 3.9520 3.8506 1.0438 0.9990 0.9996 1.0200 1.0095 1.0101 1.0129 0.9908 0.9907 1.0075 0.9859 0.9852 1.0006 1.0009 1.0028 0.9943 0.9926 0.9936
dispcorr: -0.022372082 hartree
energy: -1726.421339863040
dipole: 30.47615 -27.42608 3.05007 -12.41459 10.91619 -1.49840 7.13495 -4.28189 2.85306
magnitude: 4.43712 au
magnitude: 11.27827 debye
