program: Orca
programVersion: 4.2.1
elementType: S O O O O O O O N N N N C C C C C C C C C C C C C C C H H H H H H H H H H H H H H H H H H
charge: 0
multiplicity: 1
keywords: wb97x-d3
keywords: def2-TZVPP
keywords: def2/J RIJCOSX GRIDX6 NOFINALGRIDX
keywords: grid4 nofinalgrid
keywords: scfconv7
keywords: smallprint printgap noloewdin
keywords: NOSOSCF
formula: C15H18N4O7S
InChI: InChI=1/C15H18N4O7S/c1-4-9-26-14-16-19(15(22)18(14)2)13(21)17-27(23,24)11-8-6-5-7-10(11)12(20)25-3/h5-8,17H,4,9H2,1-3H3
45 atoms
S  -2.151295 0.3732 1.787718
O  4.569635 -0.680536 -0.645302
O  -2.795173 1.66365 1.630886
O  -2.186119 -0.301778 3.065926
O  1.304388 2.347737 0.320038
O  0.066794 -1.517002 1.398417
O  -3.780255 1.728246 -1.714265
O  -1.608982 1.515738 -1.221186
N  3.163593 1.096876 -0.29724
N  1.508693 0.029694 0.573137
N  -0.557631 0.665902 1.378066
N  2.461879 -0.924822 0.298428
C  -2.776742 -0.731913 0.55034
C  3.422128 -0.242703 -0.214626
C  -3.106066 -0.265641 -0.72442
C  1.916018 1.30133 0.209354
C  0.309089 -0.364063 1.14333
C  4.806809 -2.103084 -0.578648
C  -3.04781 -2.036556 0.929552
C  6.232778 -2.356564 -1.000178
C  4.044027 2.115612 -0.827662
C  -3.718195 -1.139741 -1.611848
C  -3.639892 -2.901732 0.021776
C  -3.976111 -2.452983 -1.243557
C  -2.737921 1.093074 -1.221581
C  7.265621 -1.755073 -0.059344
C  -3.543963 3.003424 -2.323809
H  -0.33567 1.606015 1.045128
H  4.100455 -2.606984 -1.241153
H  4.631612 -2.44866 0.442789
H  -2.811382 -2.385787 1.923632
H  6.353593 -3.441369 -1.038071
H  6.38415 -1.996716 -2.020841
H  4.238904 1.941479 -1.88282
H  3.561718 3.081496 -0.716127
H  4.98185 2.13007 -0.27838
H  -3.981941 -0.803525 -2.605191
H  -3.844238 -3.922145 0.313429
H  -4.444166 -3.122493 -1.951638
H  7.21066 -0.666625 -0.030815
H  7.131623 -2.122465 0.959712
H  8.274692 -2.020681 -0.374034
H  -2.872387 2.912497 -3.176357
H  -3.133166 3.712789 -1.606927
H  -4.513927 3.352801 -2.662688
elementType: S O N C H
totalener: -1726.39881468 hartree
nucrepener: 2838.12849067 hartree
electener: -4564.52730535 hartree
oneelecener: -8010.11122520 hartree
twoeener: 3445.58391985 hartree
cpcmener: -0.05773729 hartree
kineticenergy: 1720.18310489 hartree
xcener: -141.511572952668 hartree
chargesum: -0.0000000
charge: 0.890355 -0.305473 -0.513663 -0.500152 -0.508763 -0.439732 -0.273940 -0.439567 -0.119279 0.050573 -0.200175 -0.381877 -0.132070 0.436158 0.069746 0.412995 0.352172 0.008334 -0.010844 -0.094800 -0.159940 -0.191074 -0.164390 -0.103066 0.459867 -0.257638 -0.122761 0.219030 0.124650 0.105636 0.150132 0.071935 0.067732 0.133319 0.113295 0.129070 0.150967 0.169880 0.170327 0.082584 0.079568 0.093527 0.123070 0.120213 0.134067
qa: 0.8904 -0.3055 -0.5137 -0.5002 -0.5088 -0.4397 -0.2739 -0.4396 -0.1193 0.0506 -0.2002 -0.3819 -0.1321 0.4362 0.0697 0.4130 0.3522 0.0083 -0.0108 -0.0948 -0.1599 -0.1911 -0.1644 -0.1031 0.4599 -0.2576 -0.1228 0.2190 0.1247 0.1056 0.1501 0.0719 0.0677 0.1333 0.1133 0.1291 0.1510 0.1699 0.1703 0.0826 0.0796 0.0935 0.1231 0.1202 0.1341
va: 5.7970 2.1451 1.9742 1.9989 2.0025 2.0801 2.1443 2.0522 3.3310 3.1687 3.1354 2.8021 3.7783 4.1341 3.6947 4.2586 4.4358 3.8190 3.8377 3.9292 3.8623 4.0298 3.9529 3.8937 4.0830 3.9199 3.8497 1.0441 1.0019 0.9996 1.0199 1.0105 1.0142 0.9900 1.0133 0.9911 1.0089 0.9862 0.9850 1.0075 1.0027 1.0042 0.9926 0.9939 0.9937
dispcorr: -0.022701328 hartree
energy: -1726.421516012283
dipole: 29.01596 -26.79952 2.21644 -5.77070 4.95233 -0.81837 -15.32107 11.44289 -3.87818
magnitude: 4.54121 au
magnitude: 11.54284 debye
