program: Orca
programVersion: 4.2.1
elementType: S O O O O O O O N N N N C C C C C C C C C C C C C C C H H H H H H H H H H H H H H H H H H
charge: 0
multiplicity: 1
keywords: wb97x-d3
keywords: def2-TZVPP
keywords: def2/J RIJCOSX GRIDX6 NOFINALGRIDX
keywords: grid4 nofinalgrid
keywords: scfconv7
keywords: smallprint printgap noloewdin
keywords: NOSOSCF
formula: C15H18N4O7S
InChI: InChI=1/C15H18N4O7S/c1-4-9-26-14-16-19(15(22)18(14)2)13(21)17-27(23,24)11-8-6-5-7-10(11)12(20)25-3/h5-8,17H,4,9H2,1-3H3
45 atoms
S  -2.558564 0.835068 -1.118393
O  4.497784 -0.536883 -0.742319
O  -3.029861 0.580383 -2.461913
O  -3.079044 1.965787 -0.372649
O  1.184694 2.543431 -0.206038
O  -0.362905 -0.96096 -1.921082
O  -2.784866 0.90182 2.982029
O  -0.943154 0.971692 1.715545
N  3.09631 1.228441 -0.325781
N  1.277123 0.386886 -1.113026
N  -0.910884 1.113248 -1.17472
N  2.242964 -0.57676 -1.2997
C  -2.790573 -0.637529 -0.156633
C  3.300549 -0.031772 -0.814307
C  -2.637199 -0.625195 1.232014
C  1.779283 1.523649 -0.50301
C  -0.036444 0.097371 -1.445598
C  4.676515 -1.897219 -1.190806
C  -3.267877 -1.759583 -0.8143
C  6.100798 -2.3002 -0.899847
C  4.084398 2.089055 0.288556
C  -2.971862 -1.767242 1.946036
C  -3.581397 -2.897175 -0.085829
C  -3.434324 -2.899771 1.290101
C  -2.027097 0.51407 1.978524
C  6.455472 -2.285794 0.579164
C  -2.263448 1.924703 3.840247
H  -0.57764 1.93503 -0.665604
H  4.460569 -1.949639 -2.259438
H  3.969784 -2.540702 -0.661677
H  -3.404483 -1.75834 -1.885389
H  6.219051 -3.309957 -1.299022
H  6.7867 -1.665625 -1.466038
H  4.479451 1.632666 1.192669
H  4.895782 2.292482 -0.405186
H  3.608265 3.028269 0.551698
H  -2.856567 -1.784411 3.021077
H  -3.945875 -3.774928 -0.600269
H  -3.682063 -3.782788 1.862365
H  6.41726 -1.281389 1.000962
H  5.775717 -2.915679 1.155719
H  7.465427 -2.664223 0.735671
H  -2.086482 2.847399 3.28949
H  -1.341446 1.601143 4.321147
H  -3.025508 2.093793 4.594119
elementType: S O N C H
totalener: -1726.39813449 hartree
nucrepener: 2858.60824822 hartree
electener: -4585.00638271 hartree
oneelecener: -8051.03831774 hartree
twoeener: 3466.03193503 hartree
cpcmener: -0.05735666 hartree
kineticenergy: 1720.18352129 hartree
xcener: -141.511043460092 hartree
chargesum: -0.0000000
charge: 0.890751 -0.304279 -0.502470 -0.513327 -0.507323 -0.436005 -0.275084 -0.439436 -0.116328 0.049565 -0.201168 -0.379220 -0.129257 0.433709 0.072020 0.411803 0.346071 0.008638 -0.018528 -0.095863 -0.160967 -0.189050 -0.162131 -0.104603 0.462715 -0.257049 -0.123188 0.217430 0.121060 0.107448 0.151298 0.071908 0.068956 0.130384 0.132501 0.114234 0.151069 0.170022 0.169961 0.082226 0.080585 0.092926 0.120409 0.123125 0.134464
qa: 0.8908 -0.3043 -0.5025 -0.5133 -0.5073 -0.4360 -0.2751 -0.4394 -0.1163 0.0496 -0.2012 -0.3792 -0.1293 0.4337 0.0720 0.4118 0.3461 0.0086 -0.0185 -0.0959 -0.1610 -0.1891 -0.1621 -0.1046 0.4627 -0.2570 -0.1232 0.2174 0.1211 0.1074 0.1513 0.0719 0.0690 0.1304 0.1325 0.1142 0.1511 0.1700 0.1700 0.0822 0.0806 0.0929 0.1204 0.1231 0.1345
va: 5.7949 2.1462 1.9954 1.9742 2.0044 2.0826 2.1462 2.0540 3.3289 3.1684 3.1285 2.8025 3.7765 4.1379 3.6911 4.2579 4.4389 3.8218 3.8440 3.9287 3.8599 4.0293 3.9497 3.8956 4.0759 3.9209 3.8500 1.0473 1.0010 0.9999 1.0187 1.0109 1.0132 0.9904 0.9909 1.0133 1.0087 0.9862 0.9851 1.0074 1.0022 1.0047 0.9937 0.9928 0.9939
dispcorr: -0.023074510 hartree
energy: -1726.421208999091
dipole: 31.15868 -27.88154 3.27714 -11.21683 9.34819 -1.86865 13.03656 -10.02954 3.00702
magnitude: 4.82428 au
magnitude: 12.26235 debye
