program: Gaussian 09
title: 000068936
version: EM64L-G09RevD.01
frameworkgroup: C1[X(C13H15NO2)]
method: RPBEPBE
basis: SDD
operation: Freq
keyword: #p
keyword: freq=noraman
keyword: PBEPBE/SDD
title: #p freq=noraman PBEPBE/SDD
converged: YES YES NO NO
title: Mulliken charges:
elementType: O O N C C C C C C C C C C C C C H H H H H H H H H H H H H H H
charge: -0.285571 -0.224417 -0.409869 0.335268 -0.226958 0.135748 -0.666136 -0.682091 -0.133968 -0.329293 0.488787 -0.386592 -0.396404 -0.233648 -0.235495 -0.241148 0.229227 0.320311 0.234636 0.235318 0.203850 0.238016 0.239526 0.199871 0.240047 0.216397 0.224567 0.228135 0.225513 0.226894 0.229477
chargesum: 0.00000
title: Mulliken charges with hydrogens summed into heavy atoms:
elementType: O O N C C C C C C C C C C C C C
charge: -0.285571 -0.224417 -0.089557 0.335268 0.002269 0.135748 0.007669 -0.004678 0.106078 -0.112896 0.488787 -0.162025 -0.168270 -0.008135 -0.008601 -0.011671
polarizability: 2.58718228e+02 6.20995000e+00 1.18042544e+02 2.37128039e+00 1.73171776e+01 1.16908020e+02
1716.lowfreq: -18.6882 -6.9030 -3.1412 0.0003 0.0006 0.0007 12.0753 27.5307 40.1411
frequency: 11.6244 27.4629 40.1064 83.8837 87.7569 100.8036 179.6716 200.0297 219.7349 230.1305 276.4648 299.8186 317.7198 331.9400 363.6318 403.4380 453.4413 477.6192 484.8387 526.6415 558.5081 579.5036 590.7988 616.0437 632.9966 684.4963 695.9645 756.6685 777.4535 815.3209 840.1288 848.9479 888.1486 914.7525 921.6489 926.9624 941.2318 960.5794 974.2774 977.7472 986.3166 989.0608 997.1099 1026.8700 1081.4058 1132.3085 1138.6590 1172.8446 1191.6362 1204.5632 1214.5773 1224.9444 1234.9770 1239.2615 1277.2713 1298.0627 1322.3985 1347.1521 1361.8180 1377.2285 1387.9005 1393.5033 1440.6138 1449.3030 1457.0692 1470.0724 1477.0523 1486.2743 1585.0133 1612.5635 1662.1456 1671.9487 2973.4372 2987.9748 2995.4726 3082.4627 3085.2798 3095.1142 3104.8486 3114.4709 3118.1828 3120.9129 3126.6936 3138.9392 3149.5345 3165.2315 3574.9006
redmass: 3.9538 3.9145 4.7605 3.9891 4.2164 4.8827 1.0357 5.1651 1.4955 1.4127 3.6860 3.6417 3.4381 2.7290 3.7236 2.7728 3.1252 2.9798 2.9912 3.3035 1.7049 4.6352 4.4605 6.4205 6.1925 4.8546 1.7505 1.9763 4.1485 3.9528 2.4060 1.4645 2.2509 1.5779 1.7058 2.4723 4.3314 1.9833 1.2468 1.3567 1.3268 5.8904 1.3158 2.1843 1.6918 2.9247 2.2844 1.0600 1.1163 1.8248 2.0339 1.8149 1.6621 1.8378 3.9280 1.3424 1.4621 1.4125 2.0417 1.2655 5.4807 1.2217 2.2655 1.0492 1.0501 1.0719 1.0568 2.3129 5.7837 5.9884 7.0043 8.1673 1.0835 1.0362 1.0363 1.0903 1.0989 1.0987 1.1009 1.1008 1.0872 1.0896 1.0864 1.0913 1.0960 1.1015 1.0788
irintensity: 0.6957 2.3121 2.2059 1.0192 0.4793 1.6537 0.0090 0.7948 0.3348 0.1667 1.8229 3.3291 5.8874 0.8387 4.3031 0.0641 7.6838 6.5637 8.1813 32.0091 96.1402 15.0824 6.4270 0.0925 1.0367 13.1659 43.9422 38.4821 35.8189 4.6098 12.7037 3.5189 4.4925 0.3462 0.2962 0.7943 148.1603 20.3273 26.4251 11.7812 1.8192 0.1083 4.1712 4.4660 9.5164 75.6856 20.1062 0.0393 0.4387 74.4446 26.9663 2.6103 11.1102 30.6525 159.2884 5.8081 7.4385 20.4943 115.1431 37.8346 1.5849 12.3336 8.8170 1.6897 3.4364 5.0299 9.1143 15.9277 2.7058 2.2822 146.1525 212.5379 24.4672 17.6107 23.4795 16.9042 11.6943 38.3091 19.1514 26.7203 5.6365 19.9152 1.6902 11.3213 43.3442 26.3655 31.7001
temp: 298.150 k
press: 1.00000 atm
elementType: 8 8 7 6 6 6 6 6 6 6 6 6 6 6 6 6 1 1 1 1 1 1 1 1 1 1 1 1 1 1 1
symmnumber: 1
zpe: 656536.4 jmol-1
zpe.correction: 0.250062 hartree
zpe.thermalcorrener: 0.265514 hartree
zpe.thermalcorrenthalpy: 0.266458 hartree
zpe.thermalcorrgfe: 0.204799 hartree
zpe.sumelectzpe: -708.403007 hartree
zpe.sumelectthermal: -708.387555 hartree
zpe.sumelectthermalent: -708.386610 hartree
zpe.sumelectthermalfe: -708.448270 hartree
dipole: 2.3070 1.9430 -0.9953
dipole: 3.1762
quadrupole: -65.5228 -101.0228 -95.4134
quadrupole: 3.1074 1.3583 13.0924
quadrupole: 21.7969 -13.7031 -8.0937 3.1074 1.3583 13.0924
hfenergy: -708.6530681 hartree
pointgroup: C01 [X(C13H15N1O2)]
dipole: -0.8991357 0.7754357 -0.3895571 debye
polarizability: 258.6808927|-3.6090334|100.9362691|6.217025|4.8817907|134.0516301 unknown
InChI: InChI=1S/C13H15NO2/c1-13(2)14-12(15)11(16-13)9-8-10-6-4-3-5-7-10/h3-9,11,14H,1-2H3
charge 0 multiplicity 1
31 atoms
O  -2.282759 1.090997 -0.073454
O  -1.904322 -2.411513 0.806751
N  -3.478334 -0.893244 -0.096785
C  -3.662324 0.561446 -0.296821
C  -1.459836 0.063597 0.631235
C  -2.270596 -1.256167 0.47344
C  -4.618314 1.163618 0.753382
C  -4.065009 0.91146 -1.735234
C  -0.088691 0.014607 0.02419
C  1.049375 0.192352 0.751694
C  2.440581 0.140188 0.262888
C  2.78199 -0.16603 -1.086117
C  3.497497 0.409613 1.17771
C  4.1281 -0.193809 -1.5004
C  4.846312 0.381058 0.764408
C  5.168482 0.080099 -0.578635
H  -1.396432 0.30877 1.711713
H  -4.212547 -1.575081 -0.289289
H  -4.269839 0.921517 1.772101
H  -4.649244 2.260784 0.643488
H  -5.643684 0.768682 0.628428
H  -4.021346 2.00523 -1.871509
H  -3.369763 0.440267 -2.448955
H  -5.095154 0.574341 -1.952349
H  -0.0612 -0.182527 -1.054891
H  0.938569 0.398902 1.827518
H  1.99263 -0.388594 -1.812433
H  3.253298 0.643649 2.22159
H  4.371532 -0.432554 -2.541915
H  5.643199 0.591623 1.486347
H  6.214327 0.05562 -0.904196
