program: Orca
programVersion: 4.2.1
elementType: S O O O O O O O N N N N C C C C C C C C C C C C C C C H H H H H H H H H H H H H H H H H H
charge: 0
multiplicity: 1
keywords: wb97x-d3
keywords: def2-TZVPP
keywords: def2/J RIJCOSX GRIDX6 NOFINALGRIDX
keywords: grid4 nofinalgrid
keywords: scfconv7
keywords: smallprint printgap noloewdin
keywords: NOSOSCF
formula: C15H18N4O7S
InChI: InChI=1/C15H18N4O7S/c1-4-9-26-14-16-19(15(22)18(14)2)13(21)17-27(23,24)11-8-6-5-7-10(11)12(20)25-3/h5-8,17H,4,9H2,1-3H3
45 atoms
S  -2.717813 0.823124 -1.049863
O  4.357317 -0.401581 -0.31195
O  -3.006517 0.471685 -2.423554
O  -3.355858 1.987342 -0.473766
O  0.979072 2.63872 0.051308
O  -0.443404 -0.931614 -1.6246
O  -2.091279 1.348585 2.120506
O  -0.293145 0.015669 2.0968
N  2.915251 1.352008 0.029855
N  1.147449 0.48257 -0.839232
N  -1.078175 1.11234 -0.867965
N  2.133844 -0.468222 -0.97595
C  -2.962268 -0.620479 -0.044817
C  3.159658 0.092816 -0.443594
C  -2.34439 -0.775232 1.197297
C  1.603917 1.626992 -0.209546
C  -0.154682 0.140818 -1.159072
C  4.564152 -1.756043 -0.766678
C  -3.759403 -1.621761 -0.576703
C  5.970405 -2.163626 -0.399312
C  3.862064 2.23013 0.683961
C  -2.522277 -1.968348 1.883077
C  -3.962312 -2.788784 0.144069
C  -3.338356 -2.964597 1.367141
C  -1.450253 0.237825 1.837464
C  6.242047 -3.592015 -0.847581
C  -1.364096 2.390025 2.786073
H  -0.785789 2.03136 -0.529146
H  4.408941 -1.794489 -1.847126
H  3.829609 -2.407872 -0.288574
H  -4.216226 -1.512341 -1.549721
H  6.686586 -1.484986 -0.867672
H  6.103852 -2.083037 0.68168
H  4.707016 2.431038 0.030792
H  3.364787 3.168575 0.907663
H  4.212071 1.788866 1.613615
H  -2.0303 -2.117303 2.834819
H  -4.59102 -3.56547 -0.267554
H  -3.474262 -3.882826 1.921155
H  5.55272 -4.296268 -0.379484
H  6.143055 -3.698741 -1.928779
H  7.253294 -3.894793 -0.578683
H  -1.017634 2.058348 3.763601
H  -2.067184 3.20742 2.908043
H  -0.515772 2.725116 2.192043
elementType: S O N C H
totalener: -1726.39568038 hartree
nucrepener: 2908.17248646 hartree
electener: -4634.56816684 hartree
oneelecener: -8149.73341330 hartree
twoeener: 3515.16524646 hartree
cpcmener: -0.05683637 hartree
kineticenergy: 1720.17576664 hartree
xcener: -141.510374929597 hartree
chargesum: 0.0000000
charge: 0.875946 -0.303742 -0.499620 -0.499059 -0.512188 -0.423114 -0.241901 -0.438363 -0.110086 0.052254 -0.213197 -0.378554 -0.156734 0.431937 0.124003 0.412187 0.333213 0.027327 -0.045737 -0.078057 -0.160848 -0.188929 -0.160949 -0.114240 0.438656 -0.279804 -0.133672 0.220617 0.108074 0.103255 0.152210 0.070423 0.069306 0.131699 0.114209 0.133809 0.149405 0.169627 0.169191 0.085398 0.085395 0.095441 0.128600 0.136589 0.120024
qa: 0.8759 -0.3037 -0.4996 -0.4991 -0.5122 -0.4231 -0.2419 -0.4384 -0.1101 0.0523 -0.2132 -0.3786 -0.1567 0.4319 0.1240 0.4122 0.3332 0.0273 -0.0457 -0.0781 -0.1608 -0.1889 -0.1609 -0.1142 0.4387 -0.2798 -0.1337 0.2206 0.1081 0.1033 0.1522 0.0704 0.0693 0.1317 0.1142 0.1338 0.1494 0.1696 0.1692 0.0854 0.0854 0.0954 0.1286 0.1366 0.1200
va: 5.7920 2.1495 1.9989 1.9785 1.9921 2.0883 2.1566 2.0483 3.3307 3.1808 3.1050 2.7920 3.8142 4.1319 3.5656 4.2333 4.4487 3.8208 3.9040 3.9050 3.8580 4.0180 3.9498 3.8988 4.0923 3.9509 3.8416 1.0375 0.9982 1.0004 1.0138 1.0094 1.0101 0.9916 1.0129 0.9902 1.0078 0.9864 0.9855 1.0006 1.0007 1.0031 0.9935 0.9938 0.9996
dispcorr: -0.024986864 hartree
energy: -1726.420667244478
dipole: 31.56823 -28.41452 3.15371 -12.06331 11.18592 -0.87738 8.33437 -5.78995 2.54442
magnitude: 4.14606 au
magnitude: 10.53844 debye
