program: Gaussian 09
title: 000007566
version: EM64L-G09RevD.01
frameworkgroup: C1[X(C12H10N2O2S)]
method: RPBEPBE
basis: SDD
operation: Freq
keyword: #p
keyword: freq=noraman
keyword: PBEPBE/SDD
title: #p freq=noraman PBEPBE/SDD
converged: YES YES NO NO
title: Mulliken charges:
elementType: S O O N N C C C C C C C C C C C C H H H H H H H H H H
charge: 0.261759 -0.221848 -0.221582 0.020767 -0.691296 -0.227568 -0.286454 -0.102573 -0.201456 0.377824 -0.186150 -0.188685 -0.372835 -0.345327 0.497602 -0.394291 -0.394617 0.267329 0.250001 0.255198 0.255460 0.285364 0.287050 0.225504 0.225570 0.312641 0.312615
chargesum: 0.00000
title: Mulliken charges with hydrogens summed into heavy atoms:
elementType: S O O N N C C C C C C C C C C C C
charge: 0.261759 -0.221848 -0.221582 0.020767 -0.066041 -0.227568 -0.286454 0.164757 0.048545 0.377824 0.069048 0.066775 -0.087471 -0.058277 0.497602 -0.168788 -0.169047
polarizability: 3.00161513e+02 -1.11493203e+01 1.67809560e+02 -5.52653881e-01 4.59562372e-01 1.06380521e+02
1716.lowfreq: -5.0568 -2.0693 -0.0023 -0.0020 -0.0014 4.4344 20.8526 36.0942 36.7791
frequency: 20.8262 36.0809 36.7772 75.0720 85.6474 127.0135 175.1819 235.2269 265.9228 267.5937 289.9073 348.6770 386.7760 397.0286 407.2935 410.3038 412.2938 425.0357 470.1866 499.4276 508.7387 525.9504 617.5178 629.5744 630.8730 663.4449 686.4084 713.9562 724.1761 787.4885 815.0120 815.4615 828.1082 839.3790 853.0720 945.7817 958.4536 982.5412 987.9410 994.0937 997.2712 1017.6941 1058.3465 1082.1686 1095.2568 1110.4889 1125.3349 1178.7439 1185.3072 1224.3874 1288.2934 1294.4698 1319.7813 1348.5765 1377.9097 1389.3666 1418.5459 1428.4015 1457.9622 1493.5518 1570.7868 1581.6504 1591.5186 1619.2957 1647.4481 3127.5081 3129.5550 3145.3654 3155.8344 3158.1846 3160.7791 3181.6568 3184.2060 3564.2805 3703.2551
redmass: 4.8378 4.5192 6.6451 6.5423 8.8381 5.8331 7.7561 5.9888 7.4494 8.1068 5.6101 9.2265 2.7892 1.0503 1.3019 2.8606 2.7709 7.0442 3.3391 8.0519 5.3604 3.1500 6.9407 7.0245 6.9341 5.1595 8.7581 3.2820 4.6218 9.3137 5.2030 1.2601 1.8124 1.2984 1.4840 1.3376 1.3547 1.3338 4.0318 1.3465 3.4866 1.4467 3.6296 3.1246 2.9595 1.2919 1.2221 1.3960 1.1085 4.9146 1.2610 1.3237 2.7095 6.5636 4.4975 7.6309 4.9479 3.7315 2.1704 2.9936 6.9749 7.9842 6.2947 4.4473 1.2534 1.0887 1.0885 1.0902 1.0957 1.0893 1.0963 1.0950 1.0959 1.0452 1.1040
irintensity: 0.0111 0.2876 1.4224 0.1661 3.2039 3.5168 0.8280 0.0181 1.5988 0.6707 0.9024 0.5553 2.2448 0.0074 301.2012 0.0737 0.0709 21.9819 11.0359 17.2793 6.9082 11.9360 4.0416 2.2837 0.1386 18.3272 0.2429 0.1690 8.7836 28.3552 1.3578 0.3914 84.1944 13.2257 40.3326 0.2177 0.0057 3.3405 13.2337 1.7373 12.0780 0.1529 63.4733 21.0062 6.1463 11.7452 16.1146 126.0644 64.9111 527.9281 1.0853 2.3477 71.1237 63.8694 4.5586 59.8330 18.5708 0.0337 29.6334 121.7603 3.9643 0.6826 232.1642 118.7854 271.5325 8.1057 26.2836 4.4444 14.2152 1.1008 1.7877 0.0111 1.7816 104.6460 24.4699
temp: 298.150 k
press: 1.00000 atm
elementType: 16 8 8 7 7 6 6 6 6 6 6 6 6 6 6 6 6 1 1 1 1 1 1 1 1 1 1
symmnumber: 1
zpe: 516149.3 jmol-1
zpe.correction: 0.196591 hartree
zpe.thermalcorrener: 0.211707 hartree
zpe.thermalcorrenthalpy: 0.212651 hartree
zpe.thermalcorrgfe: 0.151959 hartree
zpe.sumelectzpe: -1120.015107 hartree
zpe.sumelectthermal: -1119.999991 hartree
zpe.sumelectthermalent: -1119.999047 hartree
zpe.sumelectthermalfe: -1120.059739 hartree
dipole: 9.2088 -0.3702 0.0154
dipole: 9.2163
quadrupole: -111.1349 -105.2589 -99.1746
quadrupole: -29.7746 0.1299 0.0891
quadrupole: -5.9454 -0.0694 6.0148 -29.7746 0.1299 0.0891
hfenergy: -1120.2116982 hartree
pointgroup: C01 [X(C12H10N2O2S1)]
dipole: -3.6084426 -0.3307523 -0.1316662 debye
polarizability: 298.5572019|18.583124|162.0440669|5.7528984|-19.1411842|113.7503246 unknown
InChI: InChI=1S/C12H10N2O2S/c13-9-1-5-11(6-2-9)17-12-7-3-10(4-8-12)14(15)16/h1-8H,13H2
charge 0 multiplicity 1
27 atoms
S  -0.864543 2.056522 -0.795516
O  4.427772 -1.890688 0.970919
O  5.521848 0.006683 0.324289
N  4.43969 -0.677138 0.519277
N  -5.283148 -1.966924 0.308841
C  0.688628 1.174879 -0.381787
C  -2.161645 0.801395 -0.443732
C  0.721149 -0.152526 0.114671
C  1.90153 1.890878 -0.579837
C  3.148728 -0.038095 0.209447
C  -2.607253 -0.066425 -1.469425
C  -2.771629 0.7451 0.832364
C  1.952312 -0.763187 0.412082
C  3.13503 1.287599 -0.285318
C  -4.259392 -1.058011 0.06176
C  -3.641271 -0.988496 -1.223693
C  -3.806576 -0.173608 1.08736
H  -0.212559 -0.702121 0.265862
H  1.876144 2.916263 -0.963985
H  -2.142986 -0.018559 -2.459963
H  -2.435379 1.421736 1.624916
H  2.004032 -1.785558 0.795845
H  4.080373 1.816979 -0.429656
H  -3.976597 -1.655514 -2.026699
H  -4.270502 -0.207281 2.080252
H  -5.610312 -2.59577 -0.418881
H  -5.728344 -2.017432 1.220608
