program: Orca
programVersion: 4.2.1
elementType: S O O O O O O O N N N N C C C C C C C C C C C C C C C H H H H H H H H H H H H H H H H H H
charge: 0
multiplicity: 1
keywords: wb97x-d3
keywords: def2-TZVPP
keywords: def2/J RIJCOSX GRIDX6 NOFINALGRIDX
keywords: grid4 nofinalgrid
keywords: scfconv7
keywords: smallprint printgap noloewdin
keywords: NOSOSCF
formula: C15H18N4O7S
InChI: InChI=1/C15H18N4O7S/c1-4-9-26-14-16-19(15(22)18(14)2)13(21)17-27(23,24)11-8-6-5-7-10(11)12(20)25-3/h5-8,17H,4,9H2,1-3H3
45 atoms
S  -2.010228 0.651312 1.722697
O  4.835211 -0.172351 -0.466679
O  -2.780726 1.81468 1.329893
O  -1.970106 0.238494 3.106523
O  1.251072 2.628384 -0.151219
O  0.410393 -1.032947 1.725817
O  -3.890084 1.183383 -1.80322
O  -1.680002 1.284439 -1.481588
N  3.242941 1.481028 -0.496731
N  1.700536 0.46132 0.606274
N  -0.456372 1.004528 1.217449
N  2.752191 -0.421471 0.533725
C  -2.521582 -0.728783 0.735087
C  3.640276 0.226737 -0.128551
C  -2.91566 -0.544024 -0.591028
C  1.972289 1.657489 -0.032396
C  0.529554 0.057764 1.232025
C  5.211025 -1.524027 -0.128592
C  -2.621274 -1.966687 1.349213
C  4.631265 -2.540048 -1.090758
C  4.009815 2.448613 -1.24886
C  -3.413347 -1.632908 -1.292758
C  -3.10377 -3.047628 0.627194
C  -3.497803 -2.880104 -0.689317
C  -2.746403 0.751054 -1.317929
C  5.103707 -3.941686 -0.733078
C  -3.859039 2.388488 -2.574915
H  -0.326457 1.8754 0.698803
H  4.921775 -1.735004 0.90343
H  6.298822 -1.518472 -0.179417
H  -2.335119 -2.095868 2.382838
H  3.540279 -2.506503 -1.065138
H  4.939728 -2.291378 -2.108947
H  4.254231 2.060481 -2.235042
H  3.410401 3.346502 -1.366531
H  4.924055 2.707262 -0.719653
H  -3.72381 -1.515597 -2.322422
H  -3.176737 -4.016217 1.102032
H  -3.878166 -3.720583 -1.253768
H  6.191566 -4.022804 -0.767792
H  4.780126 -4.230782 0.268268
H  4.698485 -4.673944 -1.43119
H  -3.24409 2.272483 -3.466872
H  -3.489554 3.225451 -1.983195
H  -4.887341 2.579337 -2.866786
elementType: S O N C H
totalener: -1726.40121471 hartree
nucrepener: 2855.19755603 hartree
electener: -4581.59877074 hartree
oneelecener: -8044.03329763 hartree
twoeener: 3462.43452689 hartree
cpcmener: -0.04656308 hartree
kineticenergy: 1720.19381205 hartree
xcener: -141.511952018847 hartree
chargesum: 0.0000000
charge: 0.880882 -0.312634 -0.502455 -0.486166 -0.488373 -0.420338 -0.268816 -0.420343 -0.127198 0.035031 -0.203731 -0.369623 -0.134774 0.430871 0.070617 0.396534 0.348966 0.040397 -0.008351 -0.111370 -0.161874 -0.190128 -0.164333 -0.106286 0.440923 -0.275084 -0.125051 0.218598 0.101415 0.122038 0.149146 0.079436 0.070073 0.130173 0.114638 0.128545 0.148149 0.166057 0.165635 0.083052 0.088190 0.094652 0.120233 0.119983 0.132694
qa: 0.8809 -0.3126 -0.5025 -0.4862 -0.4884 -0.4203 -0.2688 -0.4203 -0.1272 0.0350 -0.2037 -0.3696 -0.1348 0.4309 0.0706 0.3965 0.3490 0.0404 -0.0084 -0.1114 -0.1619 -0.1901 -0.1643 -0.1063 0.4409 -0.2751 -0.1251 0.2186 0.1014 0.1220 0.1491 0.0794 0.0701 0.1302 0.1146 0.1285 0.1481 0.1661 0.1656 0.0831 0.0882 0.0947 0.1202 0.1200 0.1327
va: 5.8153 2.1453 1.9880 2.0183 2.0283 2.1031 2.1423 2.0723 3.3242 3.1828 3.1338 2.7908 3.7962 4.1231 3.7023 4.2773 4.4385 3.8114 3.8438 3.8740 3.8624 4.0284 3.9526 3.8981 4.1043 3.9474 3.8563 1.0441 1.0097 0.9952 1.0212 1.0210 1.0110 0.9908 1.0138 0.9909 1.0088 0.9876 0.9867 1.0014 1.0013 1.0021 0.9929 0.9941 0.9935
dispcorr: -0.022818439 hartree
energy: -1726.424033148939
dipole: 21.35849 -19.31810 2.04039 -13.36158 12.07214 -1.28944 -16.69127 13.25821 -3.43306
magnitude: 4.19663 au
magnitude: 10.66699 debye
