program: Orca
programVersion: 4.2.1
elementType: S O O O O O O O N N N N C C C C C C C C C C C C C C C H H H H H H H H H H H H H H H H H H
charge: 0
multiplicity: 1
keywords: wb97x-d3
keywords: def2-TZVPP
keywords: def2/J RIJCOSX GRIDX6 NOFINALGRIDX
keywords: grid4 nofinalgrid
keywords: scfconv7
keywords: smallprint printgap noloewdin
keywords: NOSOSCF
formula: C15H18N4O7S
InChI: InChI=1/C15H18N4O7S/c1-4-9-26-14-16-19(15(22)18(14)2)13(21)17-27(23,24)11-8-6-5-7-10(11)12(20)25-3/h5-8,17H,4,9H2,1-3H3
45 atoms
S  -2.357514 0.55867 -1.098187
O  4.736326 -0.627303 -0.300725
O  -2.622696 0.065834 -2.43052
O  -2.957653 1.797927 -0.647716
O  1.329903 2.391956 -0.079973
O  -0.092306 -1.301892 -1.485367
O  -3.351746 1.301198 2.859444
O  -1.350506 1.339339 1.867834
N  3.284423 1.134514 -0.084851
N  1.484057 0.152885 -0.740553
N  -0.714376 0.816097 -0.940387
N  2.477899 -0.79364 -0.82948
C  -2.751969 -0.725762 0.061112
C  3.523309 -0.166785 -0.4269
C  -2.849176 -0.460573 1.429608
C  1.953882 1.367221 -0.274637
C  0.18836 -0.198919 -1.095055
C  4.975966 -2.008817 -0.644964
C  -3.077217 -1.970631 -0.452532
C  5.088772 -2.229845 -2.137485
C  4.249809 2.095077 0.400013
C  -3.277692 -1.478256 2.271193
C  -3.486132 -2.979684 0.406509
C  -3.584802 -2.733305 1.764422
C  -2.427222 0.83212 2.047768
C  6.167647 -1.389637 -2.802244
C  -3.037171 2.489753 3.591942
H  -0.427887 1.693263 -0.502133
H  4.194408 -2.631927 -0.205698
H  5.91614 -2.242854 -0.14746
H  -3.023654 -2.161927 -1.514124
H  5.315401 -3.291729 -2.265816
H  4.123452 -2.067259 -2.621092
H  5.034498 2.253902 -0.336321
H  3.740428 3.038479 0.573138
H  4.688971 1.758594 1.336438
H  -3.357065 -1.301029 3.335205
H  -3.733046 -3.953021 0.005745
H  -3.906508 -3.515885 2.437939
H  5.950587 -0.32225 -2.747097
H  7.143785 -1.554183 -2.341769
H  6.256536 -1.644628 -3.858436
H  -2.160302 2.347109 4.222581
H  -3.902443 2.69027 4.2164
H  -2.871416 3.332757 2.922102
elementType: S O N C H
totalener: -1726.40091356 hartree
nucrepener: 2850.27955883 hartree
electener: -4576.68047239 hartree
oneelecener: -8034.27036796 hartree
twoeener: 3457.58989557 hartree
cpcmener: -0.04681405 hartree
kineticenergy: 1720.19564642 hartree
xcener: -141.512630231110 hartree
chargesum: 0.0000000
charge: 0.881371 -0.313412 -0.488408 -0.502057 -0.488229 -0.419306 -0.272049 -0.424729 -0.128207 0.037017 -0.201224 -0.368647 -0.139733 0.425895 0.066907 0.396191 0.347883 0.032841 -0.004636 -0.130909 -0.159782 -0.192637 -0.162611 -0.104436 0.453377 -0.261344 -0.121119 0.217438 0.113759 0.121597 0.148110 0.081384 0.080466 0.128088 0.114645 0.128284 0.148011 0.166464 0.165391 0.081330 0.081166 0.095149 0.118930 0.131471 0.120310
qa: 0.8814 -0.3134 -0.4884 -0.5021 -0.4882 -0.4193 -0.2720 -0.4247 -0.1282 0.0370 -0.2012 -0.3686 -0.1397 0.4259 0.0669 0.3962 0.3479 0.0328 -0.0046 -0.1309 -0.1598 -0.1926 -0.1626 -0.1044 0.4534 -0.2613 -0.1211 0.2174 0.1138 0.1216 0.1481 0.0814 0.0805 0.1281 0.1146 0.1283 0.1480 0.1665 0.1654 0.0813 0.0812 0.0951 0.1189 0.1315 0.1203
va: 5.8170 2.1292 2.0150 1.9899 2.0279 2.1048 2.1435 2.0673 3.3241 3.1798 3.1342 2.7982 3.8054 4.1379 3.6866 4.2766 4.4383 3.8125 3.8424 3.8796 3.8645 4.0330 3.9533 3.9010 4.0919 3.9278 3.8553 1.0457 1.0123 0.9912 1.0217 1.0108 1.0181 0.9908 1.0136 0.9912 1.0113 0.9874 0.9870 1.0073 1.0013 1.0043 0.9938 0.9938 0.9937
dispcorr: -0.023009380 hartree
energy: -1726.423922937215
dipole: 27.39749 -24.69373 2.70376 -6.75368 5.47105 -1.28263 3.34038 -0.43434 2.90604
magnitude: 4.17139 au
magnitude: 10.60284 debye
