program: Gaussian 09
title: 000073918
version: EM64L-G09RevD.01
frameworkgroup: C1[X(C10H18O)]
method: RPBEPBE
basis: SDD
operation: Freq
keyword: #pfreq=noraman
keyword: PBEPBE/SDD
title: #p freq=noraman PBEPBE/SDD
converged: YES YES NO NO
title: Mulliken charges:
elementType: O C C C C C C C C C C H H H H H H H H H H H H H H H H H H
charge: -0.226438 -0.387761 -0.383022 -0.404501 -0.395932 -0.395545 -0.413205 -0.373311 -0.496681 -0.514091 0.228481 0.194145 0.236070 0.204150 0.197472 0.204803 0.185257 0.198645 0.196416 0.193822 0.195721 0.200445 0.244568 0.240620 0.190708 0.207654 0.230263 0.232290 0.208957
chargesum: 0.00000
title: Mulliken charges with hydrogens summed into heavy atoms:
elementType: O C C C C C C C C C C
charge: -0.226438 0.042454 0.018599 -0.014441 -0.000871 -0.006001 0.031807 0.058018 -0.058765 -0.072844 0.228481
polarizability: 1.17182089e+02 -2.16174608e+00 1.04551797e+02 8.62584491e-02 8.55783328e-01 9.36707264e+01
1716.lowfreq: -12.9049 -8.1248 0.0007 0.0008 0.0008 22.1455 87.1829 95.0890 146.8795
frequency: 87.1825 95.0055 146.8553 180.8123 197.9403 218.8013 252.0115 285.2381 295.6228 326.4444 363.5758 390.6451 462.9504 510.2650 549.9454 559.5400 701.8858 730.7341 760.3970 778.8146 803.9668 847.4614 860.9602 894.6538 916.2054 940.2541 954.2555 997.2255 1011.7960 1029.7747 1067.9543 1092.3927 1099.8720 1109.2219 1123.9970 1143.6236 1161.1983 1176.8078 1199.2715 1226.6720 1236.2781 1252.8170 1284.0257 1285.2225 1306.6341 1318.1907 1326.9391 1334.9292 1338.1726 1347.0817 1351.4867 1359.9328 1368.8922 1440.2524 1452.6927 1460.9106 1463.6683 1472.2435 1474.7736 1478.6144 1483.3548 1493.5022 1610.7756 2955.1090 2960.0238 2962.6564 2966.6938 2975.7029 2981.8246 2983.7174 2988.5454 2997.7017 3007.0813 3010.3695 3022.1068 3030.0817 3037.6432 3046.6718 3049.5959 3059.1481 3066.7104
redmass: 2.5347 4.9961 3.3812 2.8372 2.5566 2.3362 2.3477 2.7420 1.8104 1.9276 2.3899 2.1875 2.1194 2.5046 2.8171 2.6207 1.2969 1.9901 1.4037 2.4432 2.5754 1.8440 1.7719 2.3352 1.8036 2.0125 2.0726 2.2314 1.7056 2.2388 1.6330 1.9735 2.3648 2.3994 2.1868 1.2030 1.4986 1.2809 1.3235 1.2261 1.2029 1.2406 1.1776 1.2381 1.3086 1.2150 1.5231 1.4122 1.3201 1.3638 1.4048 1.3659 1.4932 1.0934 1.0962 1.0815 1.0835 1.0767 1.0876 1.0750 1.0815 1.0994 7.5150 1.0604 1.0601 1.0638 1.0630 1.0619 1.0689 1.0609 1.0666 1.0640 1.0957 1.0968 1.0988 1.0964 1.0971 1.1006 1.1013 1.0993 1.0946
irintensity: 1.7419 5.9133 0.9150 0.4750 0.1716 1.0527 1.8822 4.2970 2.3125 1.1169 0.9315 1.5558 1.0316 1.4830 1.7086 0.6552 9.2023 2.8158 9.0398 11.3858 1.3426 0.8576 0.5896 0.1913 7.1310 1.8429 2.4625 3.4115 1.3356 0.3982 30.2834 8.0396 12.2389 1.0313 0.2690 4.4525 47.0964 9.0859 1.3263 1.3914 3.4819 0.5109 2.1182 0.2154 13.7069 1.7843 27.9020 4.4169 5.8732 0.3262 4.1917 0.3130 0.3742 6.4904 24.0348 6.6392 6.1159 15.4240 21.3722 1.3229 16.1023 25.3449 66.0519 26.2004 27.3782 11.2090 33.6666 53.9235 36.2617 26.2073 24.1949 35.4107 32.7611 22.0291 71.3906 66.8502 31.8239 23.2899 23.9288 69.5658 45.0654
temp: 298.150 k
press: 1.00000 atm
elementType: 8 6 6 6 6 6 6 6 6 6 6 1 1 1 1 1 1 1 1 1 1 1 1 1 1 1 1 1 1
symmnumber: 1
zpe: 685430.3 jmol-1
zpe.correction: 0.261067 hartree
zpe.thermalcorrener: 0.272287 hartree
zpe.thermalcorrenthalpy: 0.273231 hartree
zpe.thermalcorrgfe: 0.224982 hartree
zpe.sumelectzpe: -466.179066 hartree
zpe.sumelectthermal: -466.167846 hartree
zpe.sumelectthermalent: -466.166902 hartree
zpe.sumelectthermalfe: -466.215151 hartree
dipole: -0.0462 0.8209 -2.5843
dipole: 2.7120
quadrupole: -65.8698 -69.7914 -72.6700
quadrupole: -0.6471 1.0997 5.6309
quadrupole: 3.5739 -0.3477 -3.2263 -0.6471 1.0997 5.6309
hfenergy: -466.4401326 hartree
pointgroup: C01 [X(C10H18O1)]
dipole: -0.0130117 -0.3613094 -1.0038548 debye
polarizability: 116.7694158|-3.1255911|104.883878|-0.173665|-1.248622|93.7513189 unknown
InChI: InChI=1S/C10H18O/c11-10-8-6-4-2-1-3-5-7-9-10/h1-9H2
charge 0 multiplicity 1
29 atoms
O  0.52184 1.740743 1.270844
C  -0.479943 -1.549784 0.797569
C  0.338774 -1.781708 -0.493825
C  -2.00352 -1.39341 0.558685
C  1.874835 -1.704025 -0.31572
C  -2.449202 -0.307871 -0.461739
C  2.418008 -0.341602 0.194543
C  -2.025062 1.164577 -0.180094
C  1.863102 0.903875 -0.567146
C  -0.684459 1.625713 -0.831945
C  0.557068 1.430622 0.046491
H  -0.315517 -2.403578 1.486718
H  -0.106896 -0.658654 1.331472
H  0.039271 -1.041215 -1.260669
H  0.073863 -2.771746 -0.91866
H  -2.488692 -1.179744 1.532956
H  -2.416605 -2.364328 0.212677
H  2.350546 -1.933623 -1.291588
H  2.20759 -2.49482 0.38746
H  -3.55713 -0.340827 -0.492628
H  -2.119948 -0.591681 -1.48224
H  3.521234 -0.353505 0.106459
H  2.194277 -0.201711 1.268898
H  -1.959717 1.350005 0.909682
H  -2.825196 1.826993 -0.561637
H  1.744819 0.688603 -1.644621
H  2.604244 1.72249 -0.46831
H  -0.744344 2.721098 -1.010494
H  -0.544239 1.156214 -1.822842
