program: Orca
programVersion: 4.2.1
elementType: S O O O O O O O N N N N C C C C C C C C C C C C C C C H H H H H H H H H H H H H H H H H H
charge: 0
multiplicity: 1
keywords: wb97x-d3
keywords: def2-TZVPP
keywords: def2/J RIJCOSX GRIDX6 NOFINALGRIDX
keywords: grid4 nofinalgrid
keywords: scfconv7
keywords: smallprint printgap noloewdin
keywords: NOSOSCF
formula: C15H18N4O7S
InChI: InChI=1/C15H18N4O7S/c1-4-9-26-14-16-19(15(22)18(14)2)13(21)17-27(23,24)11-8-6-5-7-10(11)12(20)25-3/h5-8,17H,4,9H2,1-3H3
45 atoms
S  -2.479711 0.74172 -0.896184
O  4.709354 -0.112705 -1.142214
O  -2.8559 0.536363 -2.275561
O  -3.070855 1.823024 -0.133864
O  1.226674 2.538751 0.131167
O  -0.193664 -0.866018 -1.872411
O  -1.395662 0.908046 2.078222
O  -3.379181 0.727785 3.095155
N  3.218536 1.445259 -0.358256
N  1.398372 0.519991 -1.038044
N  -0.835703 1.047627 -0.828167
N  2.41253 -0.316384 -1.439402
C  -2.719792 -0.781822 -0.018619
C  3.470756 0.272477 -1.013852
C  -2.809507 -0.805911 1.374844
C  1.867738 1.625842 -0.355527
C  0.084023 0.15424 -1.298514
C  4.954505 -1.411023 -1.725089
C  -2.943953 -1.924812 -0.771055
C  4.671043 -2.543131 -0.760665
C  4.191123 2.328085 0.245743
C  -3.136675 -2.00291 1.996896
C  -3.238753 -3.117608 -0.129577
C  -3.33667 -3.155201 1.250957
C  -2.58536 0.373091 2.264532
C  5.43884 -2.441246 0.548149
C  -1.069195 2.068312 2.848638
H  -0.534193 1.870067 -0.302769
H  6.010304 -1.383077 -1.990155
H  4.375512 -1.512539 -2.645152
H  -2.900634 -1.893654 -1.849721
H  3.59882 -2.621857 -0.569608
H  4.951953 -3.460756 -1.284496
H  4.903567 2.676936 -0.497981
H  3.668608 3.187193 0.655933
H  4.720002 1.823632 1.051627
H  -3.222372 -2.039427 3.074768
H  -3.404163 -4.011094 -0.715489
H  -3.577566 -4.081748 1.754062
H  6.514631 -2.366267 0.377532
H  5.135815 -1.575534 1.138654
H  5.265673 -3.32423 1.16382
H  -1.064447 1.846141 3.915376
H  -1.764381 2.883566 2.648841
H  -0.070716 2.361167 2.538895
elementType: S O N C H
totalener: -1726.40083088 hartree
nucrepener: 2883.65617787 hartree
electener: -4610.05700875 hartree
oneelecener: -8099.51866307 hartree
twoeener: 3489.46165432 hartree
cpcmener: -0.04620528 hartree
kineticenergy: 1720.19633581 hartree
xcener: -141.513133277816 hartree
chargesum: -0.0000000
charge: 0.881319 -0.312818 -0.485375 -0.501182 -0.500325 -0.421732 -0.273382 -0.423307 -0.125554 0.039032 -0.200781 -0.367961 -0.161288 0.424032 0.084699 0.404659 0.356661 0.033676 0.008285 -0.133475 -0.157102 -0.197401 -0.166454 -0.105665 0.450987 -0.259459 -0.128169 0.213588 0.122226 0.113904 0.144928 0.081091 0.082091 0.128310 0.114273 0.127289 0.148187 0.165545 0.166363 0.081892 0.080349 0.094894 0.126839 0.125340 0.120969
qa: 0.8813 -0.3128 -0.4854 -0.5012 -0.5003 -0.4217 -0.2734 -0.4233 -0.1256 0.0390 -0.2008 -0.3680 -0.1613 0.4240 0.0847 0.4047 0.3567 0.0337 0.0083 -0.1335 -0.1571 -0.1974 -0.1665 -0.1057 0.4510 -0.2595 -0.1282 0.2136 0.1222 0.1139 0.1449 0.0811 0.0821 0.1283 0.1143 0.1273 0.1482 0.1655 0.1664 0.0819 0.0803 0.0949 0.1268 0.1253 0.1210
va: 5.8098 2.1306 2.0214 1.9902 2.0115 2.1027 2.1102 2.0831 3.3246 3.1863 3.1380 2.8016 3.8428 4.1397 3.6877 4.2576 4.4274 3.8135 3.8370 3.8816 3.8639 4.0253 3.9569 3.9041 4.1158 3.9294 3.8417 1.0470 0.9910 1.0109 1.0248 1.0172 1.0113 0.9914 1.0138 0.9907 1.0086 0.9881 0.9863 1.0012 1.0067 1.0048 0.9960 0.9937 1.0037
dispcorr: -0.024392481 hartree
energy: -1726.425223358589
dipole: 30.84184 -26.07115 4.77070 -10.92334 9.40964 -1.51370 8.79322 -7.48356 1.30966
magnitude: 5.17359 au
magnitude: 13.15022 debye
