program: Orca
programVersion: 4.2.1
elementType: S O O O O O O O N N N N C C C C C C C C C C C C C C C H H H H H H H H H H H H H H H H H H
charge: 0
multiplicity: 1
keywords: wb97x-d3
keywords: def2-TZVPP
keywords: def2/J RIJCOSX GRIDX6 NOFINALGRIDX
keywords: grid4 nofinalgrid
keywords: scfconv7
keywords: smallprint printgap noloewdin
keywords: NOSOSCF
formula: C15H18N4O7S
InChI: InChI=1/C15H18N4O7S/c1-4-9-26-14-16-19(15(22)18(14)2)13(21)17-27(23,24)11-8-6-5-7-10(11)12(20)25-3/h5-8,17H,4,9H2,1-3H3
45 atoms
S  -2.144885 -0.780136 -1.265643
O  4.203383 0.005354 -0.14713
O  -2.110923 -2.193361 -0.946746
O  -2.745565 -0.326973 -2.49864
O  1.44319 3.516229 -1.065068
O  -0.937155 1.915104 -1.531949
O  -2.332115 -2.343119 2.498543
O  -0.576927 -1.362685 1.521858
N  3.104716 1.984055 -0.533892
N  1.162951 1.186367 -1.017764
N  -0.540812 -0.312295 -1.253375
N  1.962735 0.099372 -0.735758
C  -2.896863 0.094505 0.081342
C  3.103117 0.62434 -0.462858
C  -2.719664 -0.331925 1.399307
C  1.841652 2.391054 -0.897124
C  -0.178891 1.010205 -1.29508
C  4.170708 -1.437352 -0.136278
C  -3.744941 1.14612 -0.225661
C  5.573361 -1.934692 0.112013
C  4.224887 2.859394 -0.27743
C  -3.414206 0.323434 2.406504
C  -4.414636 1.802131 0.796046
C  -4.248645 1.391584 2.107329
C  -1.75059 -1.401052 1.787422
C  6.566089 -1.546707 -0.973144
C  -1.501529 -3.401505 2.986684
H  0.132915 -0.995131 -0.91499
H  3.791663 -1.793386 -1.097777
H  3.486772 -1.77111 0.647166
H  -3.893975 1.455765 -1.249596
H  5.91943 -1.591212 1.090192
H  5.503744 -3.023164 0.178395
H  4.606423 2.707817 0.729839
H  5.021083 2.691296 -0.999582
H  3.884251 3.886727 -0.367418
H  -3.293727 0.013355 3.435872
H  -5.069988 2.62865 0.558814
H  -4.772684 1.89868 2.905999
H  7.54077 -1.995751 -0.78065
H  6.235582 -1.889763 -1.955517
H  6.712909 -0.467746 -1.0297
H  -2.165261 -4.076964 3.518101
H  -0.742424 -3.025472 3.672099
H  -1.021612 -3.93652 2.167697
elementType: S O N C H
totalener: -1726.40043691 hartree
nucrepener: 2849.78198233 hartree
electener: -4576.18241924 hartree
oneelecener: -8032.64515565 hartree
twoeener: 3456.46273641 hartree
cpcmener: -0.04951746 hartree
kineticenergy: 1720.19628526 hartree
xcener: -141.509552508565 hartree
chargesum: -0.0000000
charge: 0.880202 -0.301250 -0.502302 -0.485638 -0.451438 -0.418188 -0.268806 -0.425551 -0.134896 0.050435 -0.186116 -0.394153 -0.144771 0.430273 0.075330 0.367288 0.352679 0.007784 -0.004430 -0.093934 -0.159296 -0.193479 -0.162288 -0.104028 0.449003 -0.256578 -0.122399 0.209750 0.106825 0.120871 0.148523 0.067469 0.070986 0.127488 0.127493 0.111559 0.147863 0.165808 0.165242 0.093478 0.079211 0.083305 0.131804 0.120769 0.118103
qa: 0.8802 -0.3013 -0.5023 -0.4856 -0.4514 -0.4182 -0.2688 -0.4256 -0.1349 0.0504 -0.1861 -0.3942 -0.1448 0.4303 0.0753 0.3673 0.3527 0.0078 -0.0044 -0.0939 -0.1593 -0.1935 -0.1623 -0.1040 0.4490 -0.2566 -0.1224 0.2098 0.1068 0.1209 0.1485 0.0675 0.0710 0.1275 0.1275 0.1116 0.1479 0.1658 0.1652 0.0935 0.0792 0.0833 0.1318 0.1208 0.1181
va: 5.8216 2.1479 1.9894 2.0177 2.0775 2.1031 2.1441 2.0638 3.2924 3.1462 3.1361 2.7949 3.7999 4.1334 3.6898 4.3342 4.4080 3.8221 3.8430 3.9282 3.8603 4.0347 3.9545 3.8998 4.0959 3.9214 3.8566 1.0300 0.9992 1.0019 1.0222 1.0134 1.0104 0.9915 0.9902 1.0171 1.0097 0.9876 0.9868 1.0044 1.0030 1.0074 0.9940 0.9927 0.9945
dispcorr: -0.022754107 hartree
energy: -1726.423191015627
dipole: 29.88989 -27.20833 2.68156 -9.25904 7.99828 -1.26077 10.92257 -7.48282 3.43975
magnitude: 4.54006 au
magnitude: 11.53992 debye
