program: Orca
programVersion: 4.2.1
elementType: S O O O O O O O N N N N C C C C C C C C C C C C C C C H H H H H H H H H H H H H H H H H H
charge: 0
multiplicity: 1
keywords: wb97x-d3
keywords: def2-TZVPP
keywords: def2/J RIJCOSX GRIDX6 NOFINALGRIDX
keywords: grid4 nofinalgrid
keywords: scfconv7
keywords: smallprint printgap noloewdin
keywords: NOSOSCF
formula: C15H18N4O7S
InChI: InChI=1/C15H18N4O7S/c1-4-9-26-14-16-19(15(22)18(14)2)13(21)17-27(23,24)11-8-6-5-7-10(11)12(20)25-3/h5-8,17H,4,9H2,1-3H3
45 atoms
S  -2.47389 0.798193 -1.051232
O  4.629893 -0.560922 -0.908509
O  -2.835225 0.523943 -2.423104
O  -3.015349 1.958644 -0.371779
O  1.305148 2.432747 -0.033279
O  -0.277913 -1.021529 -1.819552
O  -3.276312 1.070651 2.89644
O  -1.23771 1.069218 1.980127
N  3.231473 1.168807 -0.339383
N  1.37412 0.304436 -1.001744
N  -0.819484 1.010658 -0.95891
N  2.341355 -0.631792 -1.283866
C  -2.818965 -0.642358 -0.078828
C  3.422194 -0.074865 -0.8719
C  -2.826499 -0.572606 1.314891
C  1.896249 1.438375 -0.406372
C  0.051214 0.016494 -1.307862
C  4.786193 -1.900267 -1.420721
C  -3.190971 -1.799979 -0.742807
C  6.247065 -2.266831 -1.331891
C  4.244504 2.041502 0.209598
C  -3.215151 -1.695051 2.032367
C  -3.558869 -2.917476 -0.009213
C  -3.569424 -2.864261 1.373696
C  -2.351658 0.624049 2.074296
C  6.797255 -2.280945 0.085847
C  -2.926307 2.177427 3.734403
H  -0.486795 1.827615 -0.443173
H  4.433726 -1.931378 -2.453803
H  4.170481 -2.581469 -0.827663
H  -3.204627 -1.838563 -1.821989
H  6.339546 -3.261536 -1.774622
H  6.833449 -1.595826 -1.964582
H  4.99892 2.268129 -0.539905
H  3.770498 2.968938 0.517016
H  4.715758 1.585428 1.077386
H  -3.227013 -1.667115 3.113465
H  -3.842968 -3.824046 -0.52505
H  -3.859619 -3.733103 1.948512
H  6.782805 -1.290937 0.542538
H  6.224546 -2.952628 0.728151
H  7.83173 -2.624818 0.0927
H  -2.105288 1.923181 4.404825
H  -3.814721 2.398709 4.318442
H  -2.656179 3.051074 3.141217
elementType: S O N C H
totalener: -1726.40249761 hartree
nucrepener: 2834.65766046 hartree
electener: -4561.06015806 hartree
oneelecener: -8002.89680596 hartree
twoeener: 3441.83664789 hartree
cpcmener: -0.04718556 hartree
kineticenergy: 1720.20178343 hartree
xcener: -141.512226775461 hartree
chargesum: -0.0000000
charge: 0.879391 -0.303878 -0.487084 -0.502210 -0.489119 -0.418508 -0.269363 -0.419245 -0.123439 0.046009 -0.201028 -0.374907 -0.130881 0.428452 0.068472 0.400204 0.344977 0.009828 -0.007108 -0.097391 -0.162146 -0.190293 -0.163247 -0.106267 0.439079 -0.254781 -0.122420 0.217261 0.118729 0.107141 0.147407 0.070633 0.068259 0.129268 0.115178 0.128034 0.147294 0.166274 0.165738 0.082671 0.079981 0.092392 0.119801 0.132008 0.118834
qa: 0.8794 -0.3039 -0.4871 -0.5022 -0.4891 -0.4185 -0.2694 -0.4192 -0.1234 0.0460 -0.2010 -0.3749 -0.1309 0.4285 0.0685 0.4002 0.3450 0.0098 -0.0071 -0.0974 -0.1621 -0.1903 -0.1632 -0.1063 0.4391 -0.2548 -0.1224 0.2173 0.1187 0.1071 0.1474 0.0706 0.0683 0.1293 0.1152 0.1280 0.1473 0.1663 0.1657 0.0827 0.0800 0.0924 0.1198 0.1320 0.1188
va: 5.8172 2.1440 2.0172 1.9880 2.0271 2.1057 2.1422 2.0740 3.3210 3.1621 3.1329 2.8024 3.7929 4.1351 3.6997 4.2722 4.4443 3.8229 3.8464 3.9301 3.8620 4.0292 3.9515 3.8993 4.1065 3.9202 3.8568 1.0456 1.0017 1.0002 1.0219 1.0110 1.0132 0.9913 1.0137 0.9906 1.0091 0.9876 0.9867 1.0077 1.0025 1.0048 0.9930 0.9937 0.9944
dispcorr: -0.022625445 hartree
energy: -1726.425123050906
dipole: 30.89541 -27.95937 2.93604 -10.47055 8.86302 -1.60753 10.19164 -7.68298 2.50866
magnitude: 4.18304 au
magnitude: 10.63246 debye
