program: Orca
programVersion: 4.2.1
elementType: S O O O O O O O N N N N C C C C C C C C C C C C C C C H H H H H H H H H H H H H H H H H H
charge: 0
multiplicity: 1
keywords: wb97x-d3
keywords: def2-TZVPP
keywords: def2/J RIJCOSX GRIDX6 NOFINALGRIDX
keywords: grid4 nofinalgrid
keywords: scfconv7
keywords: smallprint printgap noloewdin
keywords: NOSOSCF
formula: C15H18N4O7S
InChI: InChI=1/C15H18N4O7S/c1-4-9-26-14-16-19(15(22)18(14)2)13(21)17-27(23,24)11-8-6-5-7-10(11)12(20)25-3/h5-8,17H,4,9H2,1-3H3
45 atoms
S  -2.439886 0.782395 -1.059539
O  4.670342 -0.542569 -0.888109
O  -2.778364 0.47337 -2.429886
O  -2.999643 1.954959 -0.418648
O  1.328611 2.428848 -0.002583
O  -0.229339 -1.025626 -1.813875
O  -3.260829 1.017348 2.991648
O  -1.299421 1.161413 1.931643
N  3.262204 1.177699 -0.314904
N  1.41219 0.312718 -0.997186
N  -0.787119 1.0040 -0.955788
N  2.385146 -0.616373 -1.283501
C  -2.796349 -0.641138 -0.061953
C  3.460961 -0.059994 -0.85819
C  -2.838503 -0.554676 1.332195
C  1.925948 1.442048 -0.385641
C  0.090978 0.015668 -1.303256
C  4.837626 -1.872969 -1.419742
C  -3.156007 -1.806775 -0.718619
C  6.272456 -2.285634 -1.201122
C  4.268315 2.04694 0.252204
C  -3.249657 -1.668362 2.051754
C  -3.546303 -2.914722 0.018566
C  -3.593377 -2.844333 1.399539
C  -2.374864 0.6450 2.091739
C  6.672171 -2.368472 0.264151
C  -2.907325 2.110574 3.844473
H  -0.46365 1.813617 -0.423434
H  4.583781 -1.864602 -2.481985
H  4.15057 -2.55207 -0.908528
H  -3.143425 -1.859673 -1.797228
H  6.384233 -3.265404 -1.671843
H  6.938136 -1.609356 -1.743559
H  4.721889 1.590648 1.129538
H  5.037401 2.269169 -0.483783
H  3.793022 2.977207 0.549095
H  -3.289112 -1.628196 3.13185
H  -3.820394 -3.826158 -0.494235
H  -3.903209 -3.703911 1.978048
H  6.632615 -1.396312 0.756517
H  6.019376 -3.047766 0.815967
H  7.691888 -2.740881 0.365123
H  -2.012158 1.888944 4.425219
H  -3.749374 2.246132 4.516745
H  -2.752573 3.023877 3.270445
elementType: S O N C H
totalener: -1726.40265928 hartree
nucrepener: 2831.20036102 hartree
electener: -4557.60302030 hartree
oneelecener: -7996.00887637 hartree
twoeener: 3438.40585607 hartree
cpcmener: -0.04754440 hartree
kineticenergy: 1720.19359997 hartree
xcener: -141.511192263593 hartree
chargesum: 0.0000000
charge: 0.882917 -0.304459 -0.488536 -0.502667 -0.488741 -0.418859 -0.271956 -0.424442 -0.123779 0.045140 -0.200778 -0.374128 -0.137953 0.429177 0.064061 0.399014 0.345432 0.006134 -0.004777 -0.096135 -0.162124 -0.191861 -0.162739 -0.105611 0.453347 -0.255022 -0.120524 0.217572 0.121712 0.106067 0.147825 0.070716 0.068449 0.128389 0.128735 0.115101 0.148227 0.166290 0.165837 0.082422 0.079967 0.092628 0.118666 0.131473 0.119793
qa: 0.8829 -0.3045 -0.4885 -0.5027 -0.4887 -0.4189 -0.2720 -0.4244 -0.1238 0.0451 -0.2008 -0.3741 -0.1380 0.4292 0.0641 0.3990 0.3454 0.0061 -0.0048 -0.0961 -0.1621 -0.1919 -0.1627 -0.1056 0.4533 -0.2550 -0.1205 0.2176 0.1217 0.1061 0.1478 0.0707 0.0684 0.1284 0.1287 0.1151 0.1482 0.1663 0.1658 0.0824 0.0800 0.0926 0.1187 0.1315 0.1198
va: 5.8161 2.1425 2.0156 1.9891 2.0276 2.1051 2.1430 2.0677 3.3203 3.1625 3.1346 2.8044 3.8024 4.1330 3.6887 4.2740 4.4450 3.8234 3.8457 3.9276 3.8626 4.0314 3.9532 3.9024 4.0930 3.9204 3.8557 1.0451 1.0017 1.0006 1.0224 1.0110 1.0131 0.9902 0.9916 1.0136 1.0113 0.9876 0.9868 1.0078 1.0026 1.0048 0.9939 0.9939 0.9938
dispcorr: -0.022447243 hartree
energy: -1726.425106525118
dipole: 30.55269 -27.62067 2.93201 -10.80379 9.13832 -1.66547 11.07132 -8.41944 2.65188
magnitude: 4.28987 au
magnitude: 10.90397 debye
