program: Orca
programVersion: 4.2.1
elementType: S O O O O O O O N N N N C C C C C C C C C C C C C C C H H H H H H H H H H H H H H H H H H
charge: 0
multiplicity: 1
keywords: wb97x-d3
keywords: def2-TZVPP
keywords: def2/J RIJCOSX GRIDX6 NOFINALGRIDX
keywords: grid4 nofinalgrid
keywords: scfconv7
keywords: smallprint printgap noloewdin
keywords: NOSOSCF
formula: C15H18N4O7S
InChI: InChI=1/C15H18N4O7S/c1-4-9-26-14-16-19(15(22)18(14)2)13(21)17-27(23,24)11-8-6-5-7-10(11)12(20)25-3/h5-8,17H,4,9H2,1-3H3
45 atoms
S  -2.532787 0.826839 -1.106116
O  4.53734 -0.523384 -0.789617
O  -2.980277 0.558593 -2.453986
O  -3.062576 1.960166 -0.374111
O  1.219582 2.545021 -0.200733
O  -0.323132 -0.958711 -1.929984
O  -2.847446 0.88897 3.022656
O  -1.013681 1.014038 1.753116
N  3.137623 1.242543 -0.355629
N  1.31209 0.396523 -1.123414
N  -0.884261 1.095388 -1.135763
N  2.280024 -0.560169 -1.326148
C  -2.780175 -0.640341 -0.137822
C  3.34023 -0.014704 -0.850258
C  -2.672653 -0.61617 1.255394
C  1.814686 1.53301 -0.515021
C  -0.00484 0.09502 -1.443986
C  4.700837 -1.888408 -1.226504
C  -3.226499 -1.771715 -0.801083
C  6.10987 -2.315461 -0.896411
C  4.123723 2.100539 0.26224
C  -3.029013 -1.753503 1.967091
C  -3.558644 -2.90527 -0.074233
C  -3.463124 -2.894115 1.305951
C  -2.085374 0.530087 2.011375
C  6.428621 -2.288012 0.590683
C  -2.340752 1.907311 3.891926
H  -0.553031 1.919886 -0.630975
H  4.509156 -1.943467 -2.300226
H  3.968263 -2.517421 -0.714306
H  -3.326479 -1.779447 -1.876529
H  6.219461 -3.33268 -1.280137
H  6.822161 -1.701176 -1.453128
H  3.646787 3.040007 0.5257
H  4.51755 1.642927 1.167217
H  4.937843 2.30557 -0.428891
H  -2.951486 -1.761045 3.045906
H  -3.898989 -3.790109 -0.593979
H  -3.727965 -3.773345 1.877268
H  5.721854 -2.894593 1.160561
H  7.426121 -2.686159 0.778148
H  6.402718 -1.276863 0.997909
H  -2.153425 2.83458 3.351015
H  -1.425593 1.582596 4.386962
H  -3.114439 2.073476 4.635632
elementType: S O N C H
totalener: -1726.40141514 hartree
nucrepener: 2852.44460935 hartree
electener: -4578.84602448 hartree
oneelecener: -8038.47905051 hartree
twoeener: 3459.63302603 hartree
cpcmener: -0.04722028 hartree
kineticenergy: 1720.19433519 hartree
xcener: -141.510475115842 hartree
chargesum: -0.0000000
charge: 0.882394 -0.304049 -0.490406 -0.502540 -0.486699 -0.415026 -0.273238 -0.423157 -0.122507 0.043505 -0.200195 -0.370769 -0.134284 0.427353 0.068966 0.398072 0.338495 0.006081 -0.009669 -0.095640 -0.162372 -0.193464 -0.161961 -0.104307 0.452513 -0.255488 -0.122542 0.215051 0.121209 0.106525 0.148364 0.071109 0.068387 0.115177 0.128190 0.129716 0.148236 0.166221 0.165915 0.080374 0.092606 0.081827 0.118721 0.121089 0.132218
qa: 0.8824 -0.3040 -0.4904 -0.5025 -0.4867 -0.4150 -0.2732 -0.4232 -0.1225 0.0435 -0.2002 -0.3708 -0.1343 0.4274 0.0690 0.3981 0.3385 0.0061 -0.0097 -0.0956 -0.1624 -0.1935 -0.1620 -0.1043 0.4525 -0.2555 -0.1225 0.2151 0.1212 0.1065 0.1484 0.0711 0.0684 0.1152 0.1282 0.1297 0.1482 0.1662 0.1659 0.0804 0.0926 0.0818 0.1187 0.1211 0.1322
va: 5.8147 2.1429 2.0114 1.9889 2.0306 2.1087 2.1447 2.0706 3.3192 3.1643 3.1285 2.8076 3.7994 4.1372 3.6871 4.2746 4.4489 3.8251 3.8468 3.9262 3.8620 4.0338 3.9516 3.9001 4.0919 3.9209 3.8554 1.0488 1.0013 1.0007 1.0213 1.0110 1.0129 1.0139 0.9904 0.9912 1.0106 0.9876 0.9866 1.0025 1.0049 1.0076 0.9944 0.9929 0.9938
dispcorr: -0.022890217 hartree
energy: -1726.424305352801
dipole: 30.90071 -27.78016 3.12055 -11.30146 9.53242 -1.76905 13.11311 -10.25017 2.86294
magnitude: 4.58953 au
magnitude: 11.66565 debye
