program: Orca
programVersion: 4.2.1
elementType: S O O O O O O O N N N N C C C C C C C C C C C C C C C H H H H H H H H H H H H H H H H H H
charge: 0
multiplicity: 1
keywords: wb97x-d3
keywords: def2-TZVPP
keywords: def2/J RIJCOSX GRIDX6 NOFINALGRIDX
keywords: grid4 nofinalgrid
keywords: scfconv7
keywords: smallprint printgap noloewdin
keywords: NOSOSCF
formula: C15H18N4O7S
InChI: InChI=1/C15H18N4O7S/c1-4-9-26-14-16-19(15(22)18(14)2)13(21)17-27(23,24)11-8-6-5-7-10(11)12(20)25-3/h5-8,17H,4,9H2,1-3H3
45 atoms
S  -2.486415 0.771279 -1.117555
O  4.608206 -0.466014 -0.60657
O  -2.850645 0.389699 -2.463111
O  -3.063277 1.956731 -0.516163
O  1.234655 2.571276 -0.188123
O  -0.237026 -1.036592 -1.755364
O  -3.098744 1.106352 3.002966
O  -1.22489 1.277344 1.799965
N  3.176813 1.298413 -0.274246
N  1.366236 0.375922 -0.987082
N  -0.838505 1.045762 -1.070549
N  2.350755 -0.573298 -1.134758
C  -2.779414 -0.617365 -0.049313
C  3.401498 0.018419 -0.694989
C  -2.761691 -0.484737 1.342262
C  1.848456 1.554814 -0.447223
C  0.058534 0.043181 -1.314819
C  4.796383 -1.840231 -1.000197
C  -3.154598 -1.80841 -0.64953
C  6.227523 -2.217072 -0.699818
C  4.150851 2.215776 0.273032
C  -3.129676 -1.578256 2.114939
C  -3.501352 -2.894668 0.139906
C  -3.489116 -2.778602 1.51843
C  -2.272174 0.737708 2.046574
C  6.493549 -3.663915 -1.088191
C  -2.69978 2.208641 3.823614
H  -0.532608 1.894183 -0.590704
H  4.57318 -1.93988 -2.065279
H  4.097773 -2.47049 -0.444288
H  -3.189566 -1.897962 -1.725289
H  6.905343 -1.5560 -1.24511
H  6.425872 -2.077354 0.365583
H  3.652207 3.1538 0.498676
H  4.579053 1.818541 1.190598
H  4.942231 2.406892 -0.448048
H  -3.116172 -1.505097 3.193886
H  -3.787879 -3.825063 -0.330343
H  -3.758652 -3.622374 2.138924
H  5.846178 -4.35249 -0.542416
H  6.332005 -3.830871 -2.154458
H  7.524331 -3.939234 -0.866193
H  -2.600043 3.121464 3.237223
H  -1.761953 2.001093 4.33808
H  -3.492211 2.334252 4.555311
elementType: S O N C H
totalener: -1726.40226407 hartree
nucrepener: 2831.14271967 hartree
electener: -4557.54498374 hartree
oneelecener: -7995.86956277 hartree
twoeener: 3438.32457903 hartree
cpcmener: -0.04746340 hartree
kineticenergy: 1720.18948499 hartree
xcener: -141.510142277436 hartree
chargesum: -0.0000000
charge: 0.883557 -0.303097 -0.489899 -0.502651 -0.486927 -0.416361 -0.273153 -0.425352 -0.123316 0.045075 -0.200076 -0.373895 -0.140021 0.422130 0.065761 0.398008 0.341010 0.026628 -0.006688 -0.077919 -0.162419 -0.191453 -0.162262 -0.105134 0.457343 -0.277352 -0.121276 0.216252 0.106570 0.101534 0.148772 0.069356 0.068025 0.114756 0.128880 0.129861 0.148016 0.166498 0.165799 0.084738 0.084889 0.094900 0.120282 0.119036 0.131582
qa: 0.8836 -0.3031 -0.4899 -0.5027 -0.4869 -0.4164 -0.2732 -0.4254 -0.1233 0.0451 -0.2001 -0.3739 -0.1400 0.4221 0.0658 0.3980 0.3410 0.0266 -0.0067 -0.0779 -0.1624 -0.1915 -0.1623 -0.1051 0.4573 -0.2774 -0.1213 0.2163 0.1066 0.1015 0.1488 0.0694 0.0680 0.1148 0.1289 0.1299 0.1480 0.1665 0.1658 0.0847 0.0849 0.0949 0.1203 0.1190 0.1316
va: 5.8136 2.1458 2.0127 1.9897 2.0297 2.1074 2.1438 2.0668 3.3228 3.1603 3.1312 2.7978 3.8069 4.1388 3.6827 4.2748 4.4476 3.8254 3.8441 3.9039 3.8613 4.0326 3.9549 3.9025 4.0887 3.9517 3.8553 1.0471 0.9987 1.0011 1.0213 1.0093 1.0101 1.0135 0.9911 0.9909 1.0118 0.9874 0.9869 1.0008 1.0010 1.0032 0.9936 0.9939 0.9939
dispcorr: -0.022224337 hartree
energy: -1726.424488404987
dipole: 30.56416 -27.54338 3.02078 -13.31925 11.75722 -1.56203 9.52596 -6.54255 2.98341
magnitude: 4.52391 au
magnitude: 11.49887 debye
