program: Orca
programVersion: 4.2.1
elementType: S O O O O O O O N N N N C C C C C C C C C C C C C C C H H H H H H H H H H H H H H H H H H
charge: 0
multiplicity: 1
keywords: wb97x-d3
keywords: def2-TZVPP
keywords: def2/J RIJCOSX GRIDX6 NOFINALGRIDX
keywords: grid4 nofinalgrid
keywords: scfconv7
keywords: smallprint printgap noloewdin
keywords: NOSOSCF
formula: C15H18N4O7S
InChI: InChI=1/C15H18N4O7S/c1-4-9-26-14-16-19(15(22)18(14)2)13(21)17-27(23,24)11-8-6-5-7-10(11)12(20)25-3/h5-8,17H,4,9H2,1-3H3
45 atoms
S  -2.493309 0.665143 -0.932785
O  4.646774 -0.548898 -0.702723
O  -2.774929 0.334767 -2.311048
O  -3.062081 1.858712 -0.338326
O  1.23813 2.350412 0.171142
O  -0.248623 -1.160515 -1.5856
O  -1.656633 1.089365 2.092259
O  -3.728083 1.158143 2.932533
N  3.199909 1.141494 -0.135602
N  1.367207 0.221095 -0.788882
N  -0.843557 0.870694 -0.755767
N  2.359884 -0.688003 -1.070329
C  -2.914379 -0.73332 0.072925
C  3.42568 -0.09834 -0.664608
C  -3.130873 -0.59453 1.445838
C  1.858039 1.371003 -0.200432
C  0.051096 -0.106262 -1.090018
C  4.844647 -1.875431 -1.234956
C  -3.154473 -1.936999 -0.57208
C  6.324622 -2.16835 -1.216582
C  4.189314 2.046457 0.405205
C  -3.604968 -1.688709 2.155782
C  -3.595562 -3.028125 0.160578
C  -3.823925 -2.902355 1.520287
C  -2.894767 0.659446 2.223148
C  7.145891 -1.252877 -2.111405
C  -1.306794 2.303671 2.762533
H  -0.525206 1.724811 -0.294943
H  4.445793 -1.916804 -2.251713
H  4.291805 -2.589252 -0.620318
H  -3.013789 -2.031861 -1.638741
H  6.69317 -2.134069 -0.18809
H  6.436359 -3.204358 -1.545377
H  4.935273 2.289118 -0.348083
H  3.690619 2.962636 0.707383
H  4.675342 1.609438 1.2747
H  -3.791686 -1.597611 3.217586
H  -3.773567 -3.969172 -0.341089
H  -4.181311 -3.747503 2.09253
H  7.108045 -0.213889 -1.782489
H  8.193839 -1.553879 -2.112297
H  6.794001 -1.28814 -3.144342
H  -1.413167 2.20379 3.842156
H  -1.913765 3.137938 2.411494
H  -0.264636 2.487779 2.520411
elementType: S O N C H
totalener: -1726.40298829 hartree
nucrepener: 2844.11147666 hartree
electener: -4570.51446494 hartree
oneelecener: -8020.44039086 hartree
twoeener: 3449.92592592 hartree
cpcmener: -0.04702751 hartree
kineticenergy: 1720.18942082 hartree
xcener: -141.510839112607 hartree
chargesum: 0.0000000
charge: 0.881013 -0.303936 -0.485554 -0.502106 -0.499875 -0.420575 -0.272774 -0.423978 -0.122157 0.047801 -0.199227 -0.376146 -0.159050 0.431481 0.082986 0.406829 0.353588 0.008677 0.005591 -0.097273 -0.162078 -0.196214 -0.167599 -0.104010 0.450173 -0.255528 -0.127871 0.212847 0.107042 0.120994 0.145688 0.067700 0.071731 0.127909 0.114725 0.130287 0.148632 0.165685 0.166103 0.082548 0.092901 0.079972 0.126565 0.125442 0.121040
qa: 0.8810 -0.3039 -0.4856 -0.5021 -0.4999 -0.4206 -0.2728 -0.4240 -0.1222 0.0478 -0.1992 -0.3761 -0.1590 0.4315 0.0830 0.4068 0.3536 0.0087 0.0056 -0.0973 -0.1621 -0.1962 -0.1676 -0.1040 0.4502 -0.2555 -0.1279 0.2128 0.1070 0.1210 0.1457 0.0677 0.0717 0.1279 0.1147 0.1303 0.1486 0.1657 0.1661 0.0825 0.0929 0.0800 0.1266 0.1254 0.1210
va: 5.8108 2.1440 2.0217 1.9884 2.0120 2.1036 2.1114 2.0823 3.3221 3.1660 3.1366 2.8021 3.8418 4.1300 3.6909 4.2552 4.4349 3.8199 3.8415 3.9274 3.8629 4.0237 3.9568 3.9033 4.1168 3.9192 3.8420 1.0481 0.9993 1.0024 1.0243 1.0137 1.0109 0.9911 1.0137 0.9904 1.0085 0.9880 0.9866 1.0077 1.0046 1.0027 0.9963 0.9938 1.0032
dispcorr: -0.023530887 hartree
energy: -1726.426519174626
dipole: 36.22420 -31.50113 4.72306 -7.12114 5.62860 -1.49254 2.49503 -0.87996 1.61507
magnitude: 5.20993 au
magnitude: 13.24260 debye
