program: Orca
programVersion: 4.2.1
elementType: S O O O O O O O N N N N C C C C C C C C C C C C C C C H H H H H H H H H H H H H H H H H H
charge: 0
multiplicity: 1
keywords: wb97x-d3
keywords: def2-TZVPP
keywords: def2/J RIJCOSX GRIDX6 NOFINALGRIDX
keywords: grid4 nofinalgrid
keywords: scfconv7
keywords: smallprint printgap noloewdin
keywords: NOSOSCF
formula: C15H18N4O7S
InChI: InChI=1/C15H18N4O7S/c1-4-9-26-14-16-19(15(22)18(14)2)13(21)17-27(23,24)11-8-6-5-7-10(11)12(20)25-3/h5-8,17H,4,9H2,1-3H3
45 atoms
S  -2.249433 0.576218 1.561868
O  4.649997 -0.365379 -0.412252
O  -2.96568 1.789508 1.223411
O  -2.257311 0.087275 2.92128
O  1.181281 2.567186 0.008867
O  0.11187 -1.202516 1.52106
O  -1.978684 1.379288 -1.476936
O  -4.146145 1.336233 -2.023539
N  3.13891 1.365672 -0.352533
N  1.504072 0.321679 0.579853
N  -0.667919 0.891555 1.11458
N  2.520095 -0.598548 0.47485
C  -2.788397 -0.734703 0.493701
C  3.4647 0.065849 -0.084808
C  -3.222972 -0.479821 -0.80959
C  1.856359 1.556307 0.068759
C  0.28884 -0.083655 1.117046
C  4.939996 -1.750066 -0.131109
C  -2.877562 -2.005517 1.042151
C  6.344493 -2.041536 -0.603905
C  3.983061 2.361029 -0.974817
C  -3.747297 -1.531036 -1.549431
C  -3.377591 -3.047531 0.277149
C  -3.809551 -2.810288 -1.016545
C  -3.185955 0.853664 -1.482373
C  6.709013 -3.492842 -0.327363
C  -1.824812 2.677812 -2.055812
H  -0.46737 1.812995 0.722528
H  4.210642 -2.379018 -0.64745
H  4.840705 -1.923697 0.943404
H  -2.567937 -2.191137 2.060525
H  6.422931 -1.837099 -1.674459
H  7.049159 -1.379571 -0.094896
H  4.884477 2.517775 -0.387005
H  4.251569 2.059399 -1.98477
H  3.434472 3.296665 -1.0253
H  -4.095889 -1.352474 -2.557995
H  -3.437413 -4.039695 0.703208
H  -4.206475 -3.618885 -1.614926
H  7.723042 -3.70722 -0.664676
H  6.66325 -3.723282 0.738609
H  6.039844 -4.182486 -0.844753
H  -0.779737 2.940377 -1.924978
H  -2.449726 3.413828 -1.549857
H  -2.061924 2.665701 -3.117976
elementType: S O N C H
totalener: -1726.40238023 hartree
nucrepener: 2844.31557563 hartree
electener: -4570.71795586 hartree
oneelecener: -8020.80676894 hartree
twoeener: 3450.08881309 hartree
cpcmener: -0.04662492 hartree
kineticenergy: 1720.18586460 hartree
xcener: -141.509878603638 hartree
chargesum: -0.0000000
charge: 0.882405 -0.302594 -0.501061 -0.486559 -0.500293 -0.417594 -0.272813 -0.424815 -0.122414 0.046528 -0.199347 -0.374629 -0.171828 0.423662 0.088606 0.406572 0.350989 0.027010 0.012696 -0.078488 -0.161387 -0.197685 -0.166293 -0.104047 0.452958 -0.277010 -0.125005 0.212355 0.103882 0.104283 0.145115 0.068720 0.069233 0.129504 0.129814 0.114124 0.148386 0.165898 0.166019 0.094868 0.084695 0.085412 0.118941 0.124811 0.126376
qa: 0.8824 -0.3026 -0.5011 -0.4866 -0.5003 -0.4176 -0.2728 -0.4248 -0.1224 0.0465 -0.1993 -0.3746 -0.1718 0.4237 0.0886 0.4066 0.3510 0.0270 0.0127 -0.0785 -0.1614 -0.1977 -0.1663 -0.1040 0.4530 -0.2770 -0.1250 0.2124 0.1039 0.1043 0.1451 0.0687 0.0692 0.1295 0.1298 0.1141 0.1484 0.1659 0.1660 0.0949 0.0847 0.0854 0.1189 0.1248 0.1264
va: 5.8091 2.1469 1.9902 2.0194 2.0116 2.1066 2.1124 2.0820 3.3252 3.1649 3.1364 2.7957 3.8550 4.1340 3.6835 4.2567 4.4361 3.8244 3.8277 3.9038 3.8614 4.0265 3.9559 3.9025 4.1127 3.9513 3.8433 1.0470 1.0003 0.9995 1.0240 1.0098 1.0095 0.9912 0.9906 1.0139 1.0094 0.9879 0.9867 1.0032 1.0010 1.0008 1.0043 0.9941 0.9958
dispcorr: -0.023286722 hartree
energy: -1726.425666950677
dipole: 33.23211 -28.92679 4.30531 -10.75906 9.64738 -1.11168 -12.90594 10.18530 -2.72064
magnitude: 5.21281 au
magnitude: 13.24992 debye
