program: Orca
programVersion: 4.2.1
elementType: S O O O O O O O N N N N C C C C C C C C C C C C C C C H H H H H H H H H H H H H H H H H H
charge: 0
multiplicity: 1
keywords: wb97x-d3
keywords: def2-TZVPP
keywords: def2/J RIJCOSX GRIDX6 NOFINALGRIDX
keywords: grid4 nofinalgrid
keywords: scfconv7
keywords: smallprint printgap noloewdin
keywords: NOSOSCF
formula: C15H18N4O7S
InChI: InChI=1/C15H18N4O7S/c1-4-9-26-14-16-19(15(22)18(14)2)13(21)17-27(23,24)11-8-6-5-7-10(11)12(20)25-3/h5-8,17H,4,9H2,1-3H3
45 atoms
S  -1.970673 0.396459 1.588809
O  4.8277 -0.367009 -0.85826
O  -2.663474 1.659228 1.470012
O  -1.895355 -0.302416 2.845712
O  1.44154 2.528033 0.138377
O  0.323502 -1.426746 1.083493
O  -4.029207 1.678242 -1.753344
O  -1.820011 1.632312 -1.415065
N  3.357354 1.360513 -0.462871
N  1.713161 0.20667 0.324702
N  -0.416342 0.727569 1.05584
N  2.709044 -0.697175 0.042288
C  -2.63635 -0.728987 0.378742
C  3.655912 0.027661 -0.422169
C  -3.132592 -0.268514 -0.840639
C  2.076805 1.505241 0.019334
C  0.502761 -0.266427 0.853716
C  5.08934 -1.778796 -0.825544
C  -2.767345 -2.057581 0.74739
C  5.490131 -2.271008 0.551286
C  4.192258 2.435808 -0.936548
C  -3.7804 -1.168964 -1.67608
C  -3.39203 -2.948391 -0.111228
C  -3.902771 -2.50283 -1.317728
C  -2.902475 1.122113 -1.337638
C  5.83013 -3.754862 0.507446
C  -3.930425 2.998719 -2.276081
H  -0.24627 1.670066 0.7057
H  5.902687 -1.920574 -1.537255
H  4.21387 -2.320536 -1.192333
H  -2.385832 -2.392185 1.700569
H  6.351859 -1.699621 0.904494
H  4.674987 -2.101955 1.256315
H  3.642657 3.364899 -0.814803
H  5.114234 2.492042 -0.361258
H  4.435742 2.304427 -1.989173
H  -4.183021 -0.828811 -2.620438
H  -3.485318 -3.987621 0.172383
H  -4.402032 -3.192196 -1.985271
H  6.133231 -4.111955 1.490324
H  4.971625 -4.350474 0.195058
H  6.649048 -3.961942 -0.183523
H  -4.944012 3.293461 -2.531893
H  -3.303247 3.031398 -3.167367
H  -3.525017 3.686351 -1.534486
totalener: -1726.37088352 hartree
nucrepener: 2834.67506915 hartree
electener: -4561.04595267 hartree
oneelecener: -8001.80782616 hartree
twoeener: 3440.76187350 hartree
kineticenergy: 1720.23200684 hartree
xcener: -141.508256858201 hartree
chargesum: 0.0000000
charge: 0.862097 -0.304821 -0.457301 -0.433341 -0.418824 -0.340351 -0.260105 -0.362819 -0.160784 0.005681 -0.211462 -0.313521 -0.184019 0.403626 0.080162 0.352631 0.321973 0.024047 0.033085 -0.115930 -0.171152 -0.183057 -0.141089 -0.093055 0.401828 -0.261947 -0.134750 0.210601 0.108593 0.101274 0.138028 0.063161 0.093122 0.123335 0.116210 0.115268 0.121599 0.133997 0.132500 0.091046 0.089965 0.072749 0.120007 0.109062 0.122682
qa: 0.8621 -0.3048 -0.4573 -0.4333 -0.4188 -0.3404 -0.2601 -0.3628 -0.1608 0.0057 -0.2115 -0.3135 -0.1840 0.4036 0.0802 0.3526 0.3220 0.0240 0.0331 -0.1159 -0.1712 -0.1831 -0.1411 -0.0931 0.4018 -0.2619 -0.1348 0.2106 0.1086 0.1013 0.1380 0.0632 0.0931 0.1233 0.1162 0.1153 0.1216 0.1340 0.1325 0.0910 0.0900 0.0727 0.1200 0.1091 0.1227
va: 5.8404 2.1355 2.0382 2.0794 2.0935 2.1825 2.1352 2.1272 3.2850 3.1857 3.1505 2.8034 3.9411 4.0931 3.7098 4.2937 4.4305 3.8434 3.8689 3.8639 3.8758 4.0659 3.9740 3.9401 4.1365 3.9502 3.8866 1.0467 0.9950 1.0117 1.0285 1.0106 1.0211 1.0149 0.9927 0.9925 1.0203 0.9989 0.9982 1.0054 1.0024 1.0026 0.9931 0.9944 0.9948
dispcorr: -0.022463616 hartree
energy: -1726.393347132525
dipole: 23.66964 -22.12867 1.54097 -10.02797 9.52473 -0.50324 -10.65879 8.34235 -2.31645
magnitude: 2.82732 au
magnitude: 7.18649 debye
