program: Orca
programVersion: 4.2.1
elementType: S O O O O O O O N N N N C C C C C C C C C C C C C C C H H H H H H H H H H H H H H H H H H
charge: 0
multiplicity: 1
keywords: wb97x-d3
keywords: def2-TZVPP
keywords: def2/J RIJCOSX GRIDX6 NOFINALGRIDX
keywords: grid4 nofinalgrid
keywords: scfconv7
keywords: smallprint printgap noloewdin
keywords: NOSOSCF
formula: C15H18N4O7S
InChI: InChI=1/C15H18N4O7S/c1-4-9-26-14-16-19(15(22)18(14)2)13(21)17-27(23,24)11-8-6-5-7-10(11)12(20)25-3/h5-8,17H,4,9H2,1-3H3
45 atoms
S  -1.987642 -0.04136 1.68558
O  4.705902 -0.307755 -1.164028
O  -2.626417 1.232139 1.926152
O  -1.846084 -1.017306 2.734513
O  1.313324 2.326839 0.380977
O  0.26079 -1.746479 0.668929
O  -2.144271 1.85096 -0.809095
O  -4.357548 2.031448 -1.08148
N  3.224521 1.30504 -0.454308
N  1.625854 0.010758 0.191234
N  -0.455843 0.369801 1.124027
N  2.62134 -0.818054 -0.265209
C  -2.772533 -0.838741 0.298851
C  3.544017 -0.012464 -0.636565
C  -3.408666 -0.111709 -0.708978
C  1.96135 1.344614 0.083037
C  0.436155 -0.564135 0.676039
C  5.007639 -1.70315 -1.341716
C  -2.843457 -2.22318 0.333411
C  5.408774 -2.390119 -0.051709
C  4.031518 2.457712 -0.769227
C  -4.136715 -0.807001 -1.666105
C  -3.542431 -2.899632 -0.653177
C  -4.194351 -2.191275 -1.647714
C  -3.380553 1.376252 -0.856965
C  6.605663 -1.750642 0.636734
C  -1.999397 3.267428 -0.854874
H  -0.259363 1.362913 1.014175
H  5.832954 -1.704749 -2.053468
H  4.15146 -2.202094 -1.801244
H  -2.360354 -2.769256 1.12974
H  4.553264 -2.440937 0.623271
H  5.643524 -3.42508 -0.315728
H  4.977404 2.424347 -0.232357
H  4.229884 2.513992 -1.837811
H  3.483797 3.344621 -0.463771
H  -4.658754 -0.252915 -2.434328
H  -3.586985 -3.979755 -0.630626
H  -4.757025 -2.714127 -2.409368
H  7.477623 -1.723211 -0.018671
H  6.397283 -0.728353 0.951228
H  6.88277 -2.311861 1.528025
H  -2.380921 3.677349 -1.789962
H  -0.933242 3.458713 -0.776179
H  -2.518546 3.739319 -0.021022
totalener: -1726.37102532 hartree
nucrepener: 2861.83044623 hartree
electener: -4588.20147155 hartree
oneelecener: -8055.27922567 hartree
twoeener: 3467.07775412 hartree
kineticenergy: 1720.23210709 hartree
xcener: -141.508266982792 hartree
chargesum: 0.0000000
charge: 0.865070 -0.306531 -0.456887 -0.429466 -0.451185 -0.335327 -0.280757 -0.340015 -0.157953 0.008693 -0.214095 -0.309240 -0.215374 0.400978 0.088452 0.365373 0.323993 0.018837 0.043750 -0.144591 -0.170839 -0.184909 -0.144432 -0.088230 0.402260 -0.239432 -0.133549 0.198441 0.110321 0.115515 0.136333 0.099913 0.071957 0.117195 0.117168 0.122517 0.130638 0.133695 0.134195 0.071491 0.077213 0.093806 0.115012 0.112833 0.127160
qa: 0.8651 -0.3065 -0.4569 -0.4295 -0.4512 -0.3353 -0.2808 -0.3400 -0.1580 0.0087 -0.2141 -0.3092 -0.2154 0.4010 0.0885 0.3654 0.3240 0.0188 0.0437 -0.1446 -0.1708 -0.1849 -0.1444 -0.0882 0.4023 -0.2394 -0.1335 0.1984 0.1103 0.1155 0.1363 0.0999 0.0720 0.1172 0.1172 0.1225 0.1306 0.1337 0.1342 0.0715 0.0772 0.0938 0.1150 0.1128 0.1272
va: 5.8289 2.1190 2.0385 2.0854 2.0558 2.1864 2.0968 2.1643 3.2866 3.1899 3.1440 2.8116 3.9518 4.1028 3.7052 4.2660 4.4232 3.8351 3.8666 3.8830 3.8759 4.0545 3.9775 3.9281 4.1574 3.9272 3.8683 1.0599 0.9904 1.0125 1.0298 1.0170 1.0126 0.9927 0.9921 1.0144 1.0172 0.9994 0.9977 1.0037 1.0092 1.0068 0.9970 1.0011 0.9955
dispcorr: -0.024019040 hartree
energy: -1726.395044355641
dipole: 30.19158 -27.23968 2.95189 -3.10360 2.88823 -0.21537 -9.35012 7.21195 -2.13817
magnitude: 3.65128 au
magnitude: 9.28081 debye
