program: Orca
programVersion: 5.0.2
elementType: S F F F F F O O O O O N N N N N C C C C C C C C C C C C C C C C H H H H H H H H H H H H H H
charge: 0
multiplicity: 1
keywords: wb97x-d3
keywords: def2-TZVPP
keywords: def2/J RIJCOSX
keywords: DEFGRID2
keywords: scfconv7
keywords: smallprint printgap noloewdin
keywords: NOSOSCF
formula: C16H14F5N5O5S
InChI: InChI=1/C16H14F5N5O5S/c1-29-10-6-22-15(30-2)26-13(10)23-14(24-26)25-32(27,28)12-8(16(19,20)21)4-3-5-9(12)31-7-11(17)18/h3-6,11,25H,7H2,1-2H3
46 atoms
S  -0.955197 0.805864 1.917694
F  -4.749201 -1.346688 0.439964
F  -2.882023 -2.030178 1.206556
F  -3.89183 -0.335462 2.107666
F  2.115282 3.691839 0.264681
F  1.628662 5.397445 -1.013123
O  -0.411978 2.656911 -0.138708
O  -1.105749 2.076311 2.597067
O  -1.282941 -0.420035 2.60989
O  -0.026763 -3.640769 -1.662174
O  4.75665 -1.814044 0.064982
N  0.652949 0.698723 1.537923
N  2.525804 -1.631585 -0.031902
N  0.390083 -1.219287 0.157082
N  2.465656 -0.553294 0.76818
N  3.553318 -3.336919 -1.183768
C  -1.823063 0.864821 0.35403
C  -2.885368 0.017995 -0.001139
C  -1.351449 1.810287 -0.570754
C  -3.378528 0.063218 -1.295799
C  1.169988 -0.36138 0.824096
C  -1.84917 1.825903 -1.870252
C  -3.585841 -0.926856 0.950653
C  1.271093 -2.028851 -0.392574
C  -2.842356 0.940275 -2.225267
C  1.159199 -3.14785 -1.24898
C  3.641795 -2.306627 -0.416178
C  0.145204 3.605187 -1.030842
C  2.332959 -3.740395 -1.612951
C  1.085365 4.448729 -0.206482
C  -0.966142 -2.709203 -2.202691
C  5.974585 -2.490955 -0.256976
H  1.179517 1.5654 1.537789
H  -4.188881 -0.57954 -1.602524
H  -1.469976 2.522636 -2.604542
H  -3.226286 0.946123 -3.235846
H  0.6828 3.114725 -1.848601
H  -0.628494 4.253888 -1.450347
H  2.320576 -4.60058 -2.270353
H  0.600987 4.93687 0.639228
H  -1.661822 -3.287404 -2.807074
H  -0.479516 -1.968363 -2.839779
H  -1.522394 -2.200606 -1.416707
H  5.962831 -3.515893 0.110961
H  6.15661 -2.486786 -1.330551
H  6.75827 -1.93359 0.246492
elementType: S F O N C H
totalener: -2165.62068915 hartree
nucrepener: 3895.47524490 hartree
electener: -6061.09593405 hartree
twoeener: 4671.56037253 hartree
cpcmener: -0.06146312 hartree
kineticenergy: 2158.24262587 hartree
xcener: -174.626794201950 hartree
chargesum: -0.0000000
charge: 0.872330 -0.179451 -0.167927 -0.175240 -0.222452 -0.219858 -0.316834 -0.521128 -0.505637 -0.366919 -0.292059 -0.187631 0.168422 -0.430949 -0.367787 -0.412279 -0.229843 -0.002346 0.397956 -0.169921 0.307176 -0.187006 0.561323 0.247965 -0.123231 0.099523 0.441826 0.010891 -0.011752 0.296954 -0.088991 -0.111195 0.212813 0.145829 0.147733 0.167829 0.132868 0.131545 0.138501 0.106035 0.125618 0.122126 0.086183 0.117824 0.117228 0.133937
qa: 0.8723 -0.1795 -0.1679 -0.1752 -0.2225 -0.2199 -0.3168 -0.5211 -0.5056 -0.3669 -0.2921 -0.1876 0.1684 -0.4309 -0.3678 -0.4123 -0.2298 -0.0023 0.3980 -0.1699 0.3072 -0.1870 0.5613 0.2480 -0.1232 0.0995 0.4418 0.0109 -0.0118 0.2970 -0.0890 -0.1112 0.2128 0.1458 0.1477 0.1678 0.1329 0.1315 0.1385 0.1060 0.1256 0.1221 0.0862 0.1178 0.1172 0.1339
va: 5.8560 1.1201 1.1196 1.1251 1.0441 1.0596 2.0896 1.9658 1.9855 2.0177 2.1401 3.1256 3.4020 3.0472 2.8751 3.0461 3.8414 3.6248 3.7636 3.9242 4.2337 3.9403 4.4099 3.9101 3.9222 3.8697 4.1226 3.7793 4.0761 4.1300 3.8339 3.8352 1.0143 1.0114 1.0049 0.9871 1.0005 0.9946 1.0050 0.9838 0.9972 0.9904 0.9992 0.9971 0.9968 0.9929
dispcorr: -0.027394440 hartree
energy: -2165.648083591267
dipole: 17.60538 -16.64277 0.96260 -7.59471 8.75857 1.16386 -21.16180 16.22211 -4.93969
magnitude: 5.16543 au
magnitude: 13.12949 debye
