program: Orca
programVersion: 5.0.2
elementType: S F F F F F O O O O O N N N N N C C C C C C C C C C C C C C C C H H H H H H H H H H H H H H
charge: 0
multiplicity: 1
keywords: wb97x-d3
keywords: def2-TZVPP
keywords: def2/J RIJCOSX
keywords: DEFGRID2
keywords: scfconv7
keywords: smallprint printgap noloewdin
keywords: NOSOSCF
formula: C16H14F5N5O5S
InChI: InChI=1/C16H14F5N5O5S/c1-29-10-6-22-15(30-2)26-13(10)23-14(24-26)25-32(27,28)12-8(16(19,20)21)4-3-5-9(12)31-7-11(17)18/h3-6,11,25H,7H2,1-2H3
46 atoms
S  -1.952599 0.36705 0.804889
F  -2.068665 1.658467 -3.642835
F  -2.001172 -0.21674 -2.63542
F  -3.306184 1.36856 -1.934305
F  0.324313 4.700294 4.0185
F  -0.507444 4.604524 1.99565
O  0.175961 1.84315 1.879266
O  -2.58904 1.133253 1.857596
O  -2.772082 -0.440288 -0.06962
O  3.040085 -4.136293 1.741286
O  0.915455 -2.254597 -2.842509
N  -0.923549 -0.681626 1.580497
N  1.02259 -2.36595 -0.607522
N  0.868063 -2.214597 1.56869
N  0.022582 -1.496665 -0.408476
N  2.472005 -3.644061 -1.848222
C  -0.88772 1.439038 -0.162244
C  -0.988801 1.638604 -1.552346
C  0.126617 2.087433 0.559071
C  -0.04373 2.427404 -2.185627
C  -0.011773 -1.458699 0.899755
C  1.064731 2.874428 -0.102427
C  -2.09679 1.09559 -2.428558
C  1.520911 -2.791162 0.581777
C  0.982521 3.021997 -1.466366
C  2.579072 -3.730339 0.549398
C  1.511876 -2.792851 -1.804119
C  0.752598 2.765118 2.788061
C  3.00495 -4.117991 -0.688727
C  -0.237979 3.862795 3.106688
C  4.067141 -5.114634 1.737311
C  1.37694 -2.634933 -4.139849
H  -0.674621 -0.431641 2.531595
H  -0.08757 2.596582 -3.249986
H  1.868424 3.355828 0.435417
H  1.719288 3.619273 -1.984935
H  0.953485 2.197266 3.695538
H  1.700344 3.178679 2.437916
H  3.804572 -4.8349 -0.813249
H  -1.181162 3.487262 3.503219
H  4.294534 -5.326712 2.778515
H  4.970307 -4.748024 1.243794
H  3.740836 -6.036125 1.249116
H  0.763092 -2.078469 -4.841465
H  2.423254 -2.367227 -4.280677
H  1.245023 -3.702643 -4.308819
elementType: S F O N C H
totalener: -2165.62358844 hartree
nucrepener: 3870.24596868 hartree
electener: -6035.86955712 hartree
twoeener: 4647.65881670 hartree
cpcmener: -0.06325583 hartree
kineticenergy: 2158.25943056 hartree
xcener: -174.629232900571 hartree
chargesum: -0.0000000
charge: 0.878594 -0.179663 -0.165900 -0.174293 -0.221702 -0.221585 -0.327763 -0.519261 -0.500434 -0.343705 -0.296294 -0.166157 0.169434 -0.386188 -0.401133 -0.411292 -0.254879 0.005448 0.348968 -0.135423 0.320285 -0.176816 0.549295 0.204522 -0.098310 0.135342 0.431143 -0.000747 -0.023141 0.318981 -0.130605 -0.109631 0.203015 0.148956 0.154173 0.169179 0.129539 0.124524 0.127589 0.099960 0.126854 0.117367 0.118002 0.131294 0.116307 0.116154
qa: 0.8786 -0.1797 -0.1659 -0.1743 -0.2217 -0.2216 -0.3278 -0.5193 -0.5004 -0.3437 -0.2963 -0.1662 0.1694 -0.3862 -0.4011 -0.4113 -0.2549 0.0054 0.3490 -0.1354 0.3203 -0.1768 0.5493 0.2045 -0.0983 0.1353 0.4311 -0.0007 -0.0231 0.3190 -0.1306 -0.1096 0.2030 0.1490 0.1542 0.1692 0.1295 0.1245 0.1276 0.1000 0.1269 0.1174 0.1180 0.1313 0.1163 0.1162
va: 5.8402 1.1191 1.1244 1.1236 1.0593 1.0454 2.0495 1.9676 1.9888 2.0404 2.1295 3.1190 3.4272 3.0906 2.8256 3.0577 3.9062 3.6837 3.7033 3.9437 4.1983 3.9557 4.4237 4.0622 3.8821 3.9576 4.1131 3.8497 3.9933 4.0940 3.8623 3.8377 1.0144 1.0080 0.9975 0.9863 1.0000 1.0034 1.0115 0.9874 0.9934 0.9855 0.9865 0.9934 0.9971 0.9972
dispcorr: -0.025666754 hartree
energy: -2165.649255195346
dipole: 31.00189 -25.67940 5.32249 -21.86532 21.50838 -0.35694 0.97893 -1.25920 -0.28027
magnitude: 5.34180 au
magnitude: 13.57778 debye
