program: Orca
programVersion: 5.0.2
elementType: S F F F F F O O O O O N N N N N C C C C C C C C C C C C C C C C H H H H H H H H H H H H H H
charge: 0
multiplicity: 1
keywords: wb97x-d3
keywords: def2-TZVPP
keywords: def2/J RIJCOSX
keywords: DEFGRID2
keywords: scfconv7
keywords: smallprint printgap noloewdin
keywords: NOSOSCF
formula: C16H14F5N5O5S
InChI: InChI=1/C16H14F5N5O5S/c1-29-10-6-22-15(30-2)26-13(10)23-14(24-26)25-32(27,28)12-8(16(19,20)21)4-3-5-9(12)31-7-11(17)18/h3-6,11,25H,7H2,1-2H3
46 atoms
S  -1.109286 1.349116 -1.184469
F  -4.292357 -0.967938 1.237065
F  -4.060981 0.455331 -0.330247
F  -3.033111 -1.451238 -0.415018
F  -1.26399 4.416669 1.44747
F  0.351742 5.892581 1.557734
O  0.614336 2.407711 0.805556
O  -1.948134 0.444153 -1.931773
O  -1.228763 2.776176 -1.3984
O  0.090703 -3.88358 0.403187
O  4.559191 -1.948901 -1.910097
N  0.462449 0.98476 -1.572573
N  2.422043 -1.746517 -1.249093
N  0.358786 -1.239398 -0.748105
N  2.278741 -0.481739 -1.67934
N  3.532983 -3.712979 -0.838125
C  -1.257155 1.001089 0.568891
C  -2.232046 0.161913 1.13881
C  -0.307516 1.617554 1.391597
C  -2.183189 -0.087341 2.500787
C  1.031172 -0.245879 -1.344554
C  -0.267947 1.336796 2.752933
C  -3.395073 -0.451968 0.386221
C  1.264958 -2.191887 -0.690477
C  -1.196267 0.478385 3.293998
C  1.245542 -3.500944 -0.15161
C  3.536928 -2.524217 -1.321998
C  0.963381 3.648146 1.396595
C  2.410963 -4.207142 -0.250221
C  -0.021262 4.717717 0.979031
C  0.057072 -5.158286 1.020679
C  5.763252 -2.709829 -2.014378
H  1.085941 1.775284 -1.693123
H  -2.911167 -0.729852 2.971163
H  0.495634 1.773209 3.382795
H  -1.163266 0.246435 4.349661
H  1.027377 3.59715 2.486325
H  1.95208 3.900936 1.014603
H  2.501198 -5.211698 0.14135
H  -0.08192 4.862798 -0.098682
H  -0.945067 -5.27753 1.425332
H  0.779225 -5.229164 1.838745
H  0.246457 -5.961627 0.304033
H  5.608811 -3.618955 -2.595341
H  6.471999 -2.067038 -2.528604
H  6.154981 -2.969463 -1.030888
elementType: S F O N C H
totalener: -2165.62503383 hartree
nucrepener: 3871.96346736 hartree
electener: -6037.58850119 hartree
twoeener: 4649.68797360 hartree
cpcmener: -0.05290197 hartree
kineticenergy: 2158.23937651 hartree
xcener: -174.624900173086 hartree
chargesum: 0.0000000
charge: 0.877084 -0.180289 -0.172060 -0.163045 -0.220011 -0.222775 -0.339583 -0.485592 -0.510295 -0.328173 -0.289036 -0.166729 0.163454 -0.410397 -0.368851 -0.407968 -0.177755 -0.002106 0.267659 -0.132415 0.303150 -0.160285 0.545685 0.197735 -0.101931 0.164416 0.426947 0.013275 -0.035308 0.313101 -0.131764 -0.111006 0.198396 0.148187 0.153426 0.164959 0.110360 0.125880 0.124852 0.100385 0.126499 0.115299 0.115393 0.114349 0.132250 0.114634
qa: 0.8771 -0.1803 -0.1721 -0.1630 -0.2200 -0.2228 -0.3396 -0.4856 -0.5103 -0.3282 -0.2890 -0.1667 0.1635 -0.4104 -0.3689 -0.4080 -0.1778 -0.0021 0.2677 -0.1324 0.3032 -0.1603 0.5457 0.1977 -0.1019 0.1644 0.4269 0.0133 -0.0353 0.3131 -0.1318 -0.1110 0.1984 0.1482 0.1534 0.1650 0.1104 0.1259 0.1249 0.1004 0.1265 0.1153 0.1154 0.1143 0.1322 0.1146
va: 5.8492 1.1174 1.1277 1.1306 1.0434 1.0584 2.0160 2.0080 1.9805 2.0557 2.1389 3.1261 3.4138 3.0362 2.8668 3.0564 3.8942 3.6934 3.7616 3.9447 4.2334 3.9897 4.4384 4.0796 3.8974 3.9116 4.1239 3.8315 4.0052 4.0771 3.8673 3.8410 1.0177 1.0085 0.9957 0.9878 1.0095 1.0009 1.0116 0.9918 0.9937 0.9870 0.9854 0.9978 0.9930 0.9977
dispcorr: -0.025744171 hartree
energy: -2165.650777996687
dipole: 31.81879 -27.84876 3.97003 -21.78265 19.94795 -1.83470 5.96836 -2.93692 3.03144
magnitude: 5.32136 au
magnitude: 13.52582 debye
