program: Orca
programVersion: 5.0.2
elementType: S F F F F F O O O O O N N N N N C C C C C C C C C C C C C C C C H H H H H H H H H H H H H H
charge: 0
multiplicity: 1
keywords: wb97x-d3
keywords: def2-TZVPP
keywords: def2/J RIJCOSX
keywords: DEFGRID2
keywords: scfconv7
keywords: smallprint printgap noloewdin
keywords: NOSOSCF
formula: C16H14F5N5O5S
InChI: InChI=1/C16H14F5N5O5S/c1-29-10-6-22-15(30-2)26-13(10)23-14(24-26)25-32(27,28)12-8(16(19,20)21)4-3-5-9(12)31-7-11(17)18/h3-6,11,25H,7H2,1-2H3
46 atoms
S  -1.126336 1.323053 -1.148407
F  -4.309235 -0.976798 1.29432
F  -4.077655 0.408256 -0.306865
F  -3.02491 -1.486457 -0.329463
F  -1.227874 4.551369 1.355409
F  0.463391 5.942125 1.43141
O  0.576942 2.424848 0.830303
O  -1.953535 0.399225 -1.885151
O  -1.256865 2.745473 -1.385715
O  0.100999 -3.942719 0.368106
O  4.556549 -1.941804 -1.913768
N  0.449924 0.966911 -1.519982
N  2.420378 -1.760489 -1.242315
N  0.357735 -1.269105 -0.722595
N  2.270417 -0.489619 -1.650938
N  3.537432 -3.733176 -0.881515
C  -1.28552 1.007449 0.609916
C  -2.262783 0.177792 1.19039
C  -0.350598 1.653098 1.428452
C  -2.233313 -0.030115 2.559929
C  1.023271 -0.264103 -1.307343
C  -0.33126 1.414043 2.798271
C  -3.408807 -0.470966 0.440571
C  1.267072 -2.220008 -0.687109
C  -1.263502 0.567361 3.350671
C  1.252783 -3.542038 -0.180017
C  3.537205 -2.53315 -1.3365
C  0.956092 3.665285 1.401462
C  2.418516 -4.243998 -0.302347
C  0.039747 4.760205 0.904212
C  0.065516 -5.243055 0.929249
C  5.761273 -2.69807 -2.040396
H  1.069676 1.759763 -1.643259
H  -2.963875 -0.663613 3.038269
H  0.420132 1.87251 3.426856
H  -1.246636 0.369456 4.413616
H  0.965031 3.647889 2.493766
H  1.971782 3.864031 1.060219
H  2.511437 -5.258723 0.061399
H  0.012866 4.850887 -0.181065
H  -0.935619 -5.377131 1.331692
H  0.790091 -5.352746 1.740726
H  0.250036 -6.014303 0.176886
H  6.468796 -2.040403 -2.537189
H  6.154445 -2.984607 -1.065019
H  5.607026 -3.59079 -2.646297
elementType: S F O N C H
totalener: -2165.62563253 hartree
nucrepener: 3860.59073580 hartree
electener: -6026.21636833 hartree
twoeener: 4638.30329706 hartree
cpcmener: -0.05328883 hartree
kineticenergy: 2158.23925968 hartree
xcener: -174.625237144072 hartree
chargesum: -0.0000000
charge: 0.875504 -0.180165 -0.171563 -0.163027 -0.220670 -0.223054 -0.338362 -0.485375 -0.509694 -0.327877 -0.289069 -0.165099 0.163407 -0.410377 -0.369752 -0.407921 -0.196945 0.000245 0.283311 -0.132250 0.304562 -0.162706 0.545932 0.197742 -0.101059 0.163901 0.426982 0.016605 -0.035940 0.313194 -0.131532 -0.110864 0.198685 0.148260 0.152428 0.164956 0.110486 0.124766 0.124852 0.099621 0.126494 0.114973 0.115305 0.132246 0.114420 0.114426
qa: 0.8755 -0.1802 -0.1716 -0.1630 -0.2207 -0.2231 -0.3384 -0.4854 -0.5097 -0.3279 -0.2891 -0.1651 0.1634 -0.4104 -0.3698 -0.4079 -0.1969 0.0002 0.2833 -0.1322 0.3046 -0.1627 0.5459 0.1977 -0.1011 0.1639 0.4270 0.0166 -0.0359 0.3132 -0.1315 -0.1109 0.1987 0.1483 0.1524 0.1650 0.1105 0.1248 0.1249 0.0996 0.1265 0.1150 0.1153 0.1322 0.1144 0.1144
va: 5.8524 1.1173 1.1279 1.1308 1.0436 1.0581 2.0191 2.0079 1.9805 2.0563 2.1386 3.1276 3.4139 3.0390 2.8667 3.0563 3.9024 3.6952 3.7585 3.9438 4.2320 3.9874 4.4370 4.0796 3.8963 3.9138 4.1236 3.8249 4.0049 4.0812 3.8674 3.8410 1.0174 1.0086 0.9967 0.9879 1.0103 1.0016 1.0117 0.9920 0.9938 0.9866 0.9857 0.9930 0.9978 0.9978
dispcorr: -0.025504782 hartree
energy: -2165.651137309526
dipole: 31.60899 -27.65993 3.94906 -21.86544 20.05282 -1.81262 5.68851 -2.67186 3.01664
magnitude: 5.28969 au
magnitude: 13.44532 debye
