program: Orca
programVersion: 5.0.2
elementType: S F F F F F O O O O O N N N N N C C C C C C C C C C C C C C C C H H H H H H H H H H H H H H
charge: 0
multiplicity: 1
keywords: wb97x-d3
keywords: def2-TZVPP
keywords: def2/J RIJCOSX
keywords: DEFGRID2
keywords: scfconv7
keywords: smallprint printgap noloewdin
keywords: NOSOSCF
formula: C16H14F5N5O5S
InChI: InChI=1/C16H14F5N5O5S/c1-29-10-6-22-15(30-2)26-13(10)23-14(24-26)25-32(27,28)12-8(16(19,20)21)4-3-5-9(12)31-7-11(17)18/h3-6,11,25H,7H2,1-2H3
46 atoms
S  -1.264278 1.265709 -1.195179
F  -4.541095 -1.474141 0.565486
F  -4.194292 -0.010403 -0.946736
F  -2.909948 -1.749816 -0.77565
F  1.817088 5.302278 1.989768
F  2.172421 3.782785 0.454213
O  -0.259273 2.620154 1.049177
O  -1.806796 0.260423 -2.078018
O  -1.494281 2.66774 -1.47098
O  0.390838 -4.046304 0.670533
O  4.416256 -1.7939 -2.142022
N  0.38085 1.078438 -1.187427
N  2.401231 -1.631174 -1.166302
N  0.406671 -1.159511 -0.417155
N  2.192893 -0.3611 -1.5521
N  3.556486 -3.60965 -1.01324
C  -1.749082 0.915446 0.492484
C  -2.697211 -0.047206 0.874513
C  -1.098117 1.675869 1.4783
C  -2.910168 -0.284603 2.224176
C  0.994027 -0.144554 -1.064796
C  -1.327721 1.420156 2.826835
C  -3.572222 -0.820896 -0.088666
C  1.315697 -2.111083 -0.487172
C  -2.217876 0.432878 3.185955
C  1.383737 -3.43894 0.000704
C  3.491073 -2.396073 -1.435325
C  0.403082 3.456101 1.975666
C  2.532348 -4.120366 -0.29038
C  1.19867 4.433746 1.147459
C  -0.384789 -3.283738 1.591249
C  5.562686 -2.563225 -2.509222
H  0.9432 1.905121 -1.351824
H  -3.625531 -1.023615 2.549636
H  -0.818787 1.983088 3.59685
H  -2.393452 0.227383 4.233084
H  -0.312744 4.009535 2.590734
H  1.069249 2.884511 2.630911
H  2.652093 -5.141206 0.052152
H  0.589452 4.998427 0.440133
H  0.231305 -2.610817 2.191044
H  -0.860152 -4.002966 2.255755
H  -1.158846 -2.710291 1.083668
H  6.172777 -1.904011 -3.119949
H  6.128622 -2.875613 -1.632056
H  5.281099 -3.440204 -3.091923
elementType: S F O N C H
totalener: -2165.62366997 hartree
nucrepener: 3875.45677305 hartree
electener: -6041.08044302 hartree
twoeener: 4651.72676021 hartree
cpcmener: -0.04871605 hartree
kineticenergy: 2158.24190909 hartree
xcener: -174.627273978597 hartree
chargesum: 0.0000000
charge: 0.860866 -0.181829 -0.171967 -0.163678 -0.218486 -0.219823 -0.300559 -0.488519 -0.505180 -0.342633 -0.286583 -0.176488 0.166979 -0.432130 -0.366196 -0.409204 -0.253082 -0.002813 0.408125 -0.168234 0.303507 -0.207422 0.570746 0.243646 -0.110849 0.113492 0.431138 0.005358 -0.026636 0.293754 -0.099914 -0.111708 0.202187 0.143532 0.144663 0.164623 0.127900 0.127088 0.134600 0.103871 0.117359 0.124611 0.092663 0.131604 0.116260 0.115358
qa: 0.8609 -0.1818 -0.1720 -0.1637 -0.2185 -0.2198 -0.3006 -0.4885 -0.5052 -0.3426 -0.2866 -0.1765 0.1670 -0.4321 -0.3662 -0.4092 -0.2531 -0.0028 0.4081 -0.1682 0.3035 -0.2074 0.5707 0.2436 -0.1108 0.1135 0.4311 0.0054 -0.0266 0.2938 -0.0999 -0.1117 0.2022 0.1435 0.1447 0.1646 0.1279 0.1271 0.1346 0.1039 0.1174 0.1246 0.0927 0.1316 0.1163 0.1154
va: 5.8820 1.1164 1.1287 1.1257 1.0614 1.0489 2.1037 2.0066 1.9832 2.0497 2.1441 3.1170 3.4006 3.0449 2.8681 3.0488 3.8716 3.6294 3.7590 3.9279 4.2387 3.9517 4.3904 3.8897 3.9282 3.8863 4.1277 3.7922 4.0662 4.1423 3.8481 3.8403 1.0149 1.0132 1.0067 0.9884 0.9949 0.9992 1.0066 0.9848 0.9919 0.9963 0.9941 0.9932 0.9967 0.9981
dispcorr: -0.026800568 hartree
energy: -2165.650470538824
dipole: 20.51564 -18.81504 1.70060 -12.31154 12.30015 -0.01139 10.77655 -6.91906 3.85749
magnitude: 4.21573 au
magnitude: 10.71554 debye
