program: Orca
programVersion: 5.0.2
elementType: S F F F F F O O O O O N N N N N C C C C C C C C C C C C C C C C H H H H H H H H H H H H H H
charge: 0
multiplicity: 1
keywords: wb97x-d3
keywords: def2-TZVPP
keywords: def2/J RIJCOSX
keywords: DEFGRID2
keywords: scfconv7
keywords: smallprint printgap noloewdin
keywords: NOSOSCF
formula: C16H14F5N5O5S
InChI: InChI=1/C16H14F5N5O5S/c1-29-10-6-22-15(30-2)26-13(10)23-14(24-26)25-32(27,28)12-8(16(19,20)21)4-3-5-9(12)31-7-11(17)18/h3-6,11,25H,7H2,1-2H3
46 atoms
S  -1.665618 1.193448 1.536555
F  -4.489166 0.19065 0.666644
F  -4.728352 -1.044354 -1.055111
F  -3.404824 -1.681317 0.4876
F  2.123247 1.580031 -1.602297
F  3.087509 3.543993 -1.504032
O  -0.186318 2.686239 -0.352355
O  -2.014401 2.545425 1.916071
O  -2.307099 0.075712 2.184396
O  0.276483 -3.780065 -0.2174
O  4.552381 -0.586808 0.547472
N  -0.035187 1.059166 1.86163
N  2.353763 -1.025296 0.690638
N  0.184226 -1.12253 0.930654
N  2.025589 0.157778 1.235089
N  3.748225 -2.612134 -0.206093
C  -1.801453 1.011163 -0.243321
C  -2.706674 0.141271 -0.876305
C  -0.926156 1.790297 -1.019571
C  -2.648328 -0.006408 -2.251676
C  0.723382 0.028469 1.353805
C  -0.873847 1.609568 -2.399495
C  -3.822042 -0.603118 -0.172797
C  1.240396 -1.784551 0.506908
C  -1.723522 0.707203 -2.996934
C  1.398123 -3.068824 -0.067328
C  3.592171 -1.452017 0.320207
C  0.821567 3.459711 -0.975785
C  2.674454 -3.423515 -0.401308
C  2.156958 2.750529 -0.907698
C  0.395489 -5.074439 -0.780372
C  5.875976 -0.967171 0.171887
H  0.447903 1.944342 1.971365
H  -3.325526 -0.669625 -2.767018
H  -0.189782 2.168999 -3.019756
H  -1.682294 0.567924 -4.068638
H  0.571549 3.73681 -2.001971
H  0.887665 4.380187 -0.39543
H  2.89779 -4.383687 -0.8470
H  2.480459 2.533998 0.110389
H  0.800008 -5.038621 -1.795222
H  -0.609876 -5.486989 -0.816491
H  1.022798 -5.725408 -0.165788
H  5.946537 -1.151398 -0.900072
H  6.508836 -0.1250 0.437023
H  6.203715 -1.853356 0.715274
elementType: S F O N C H
totalener: -2165.62592087 hartree
nucrepener: 3956.91224021 hartree
electener: -6122.53816109 hartree
twoeener: 4733.92824465 hartree
cpcmener: -0.05464370 hartree
kineticenergy: 2158.23458854 hartree
xcener: -174.624269139102 hartree
chargesum: 0.0000000
charge: 0.865788 -0.172437 -0.179430 -0.164107 -0.218885 -0.221112 -0.311760 -0.503896 -0.480294 -0.326486 -0.292527 -0.168711 0.180389 -0.388809 -0.394201 -0.405902 -0.227151 -0.015623 0.368098 -0.135532 0.281432 -0.174290 0.547412 0.201393 -0.129285 0.155791 0.427114 -0.006330 -0.034444 0.317814 -0.132689 -0.112063 0.197789 0.146581 0.140611 0.164471 0.122156 0.137057 0.125282 0.096603 0.115249 0.126435 0.115936 0.114491 0.131836 0.116236
qa: 0.8658 -0.1724 -0.1794 -0.1641 -0.2189 -0.2211 -0.3118 -0.5039 -0.4803 -0.3265 -0.2925 -0.1687 0.1804 -0.3888 -0.3942 -0.4059 -0.2272 -0.0156 0.3681 -0.1355 0.2814 -0.1743 0.5474 0.2014 -0.1293 0.1558 0.4271 -0.0063 -0.0344 0.3178 -0.1327 -0.1121 0.1978 0.1466 0.1406 0.1645 0.1222 0.1371 0.1253 0.0966 0.1152 0.1264 0.1159 0.1145 0.1318 0.1162
va: 5.8620 1.1281 1.1187 1.1294 1.0425 1.0618 2.0936 1.9906 2.0058 2.0579 2.1303 3.1143 3.3904 3.0459 2.8185 3.0607 3.7963 3.7345 3.7481 3.9532 4.2194 3.9416 4.4345 4.0638 3.9307 3.9322 4.1138 3.8479 4.0038 4.0672 3.8676 3.8415 1.0176 1.0088 1.0115 0.9887 1.0033 0.9976 1.0117 0.9957 0.9858 0.9939 0.9860 0.9974 0.9930 0.9977
dispcorr: -0.027389121 hartree
energy: -2165.653309993959
dipole: 27.54004 -24.04951 3.49054 -10.71301 10.44216 -0.27085 -9.48759 6.07603 -3.41156
magnitude: 4.88835 au
magnitude: 12.42519 debye
