program: Orca
programVersion: 5.0.2
elementType: S F F F F F O O O O O N N N N N C C C C C C C C C C C C C C C C H H H H H H H H H H H H H H
charge: 0
multiplicity: 1
keywords: wb97x-d3
keywords: def2-TZVPP
keywords: def2/J RIJCOSX
keywords: DEFGRID2
keywords: scfconv7
keywords: smallprint printgap noloewdin
keywords: NOSOSCF
formula: C16H14F5N5O5S
InChI: InChI=1/C16H14F5N5O5S/c1-29-10-6-22-15(30-2)26-13(10)23-14(24-26)25-32(27,28)12-8(16(19,20)21)4-3-5-9(12)31-7-11(17)18/h3-6,11,25H,7H2,1-2H3
46 atoms
S  -2.447233 -0.133581 0.617039
F  -3.772324 0.982071 -2.044589
F  -2.541937 1.897635 -3.523809
F  -2.056991 -0.069408 -2.864704
F  1.907418 1.356695 2.11691
F  1.973709 1.765882 4.267671
O  -0.925436 1.623741 2.184355
O  -3.366873 0.27723 1.655526
O  -2.919762 -0.953076 -0.472471
O  3.793203 -2.496095 1.701161
O  1.265478 -1.545656 -2.964005
N  -1.25599 -1.015473 1.380479
N  1.305704 -1.691023 -0.726425
N  1.004801 -1.705984 1.436062
N  0.022007 -1.33612 -0.569686
N  3.222966 -2.147203 -1.901615
C  -1.590256 1.304096 -0.024962
C  -1.630088 1.723698 -1.365906
C  -0.827284 2.025519 0.909864
C  -0.854391 2.803853 -1.753499
C  -0.088474 -1.361755 0.737231
C  -0.042973 3.096031 0.490916
C  -2.504462 1.111787 -2.440639
C  1.889026 -1.915221 0.481521
C  -0.059105 3.467733 -0.833429
C  3.254852 -2.29065 0.494129
C  1.984705 -1.809292 -1.899575
C  -0.065166 2.0979 3.202143
C  3.863111 -2.386787 -0.726044
C  1.194711 1.262573 3.272566
C  5.172558 -2.815191 1.751349
C  1.91827 -1.624452 -4.231915
H  -1.186365 -0.887981 2.38391
H  -0.858186 3.15151 -2.774645
H  0.571329 3.653251 1.182217
H  0.548292 4.301024 -1.159275
H  0.17108 3.159692 3.10194
H  -0.616467 1.971998 4.134059
H  4.905618 -2.660867 -0.819441
H  1.007065 0.206735 3.469992
H  5.390295 -3.755467 1.237677
H  5.426033 -2.923298 2.803174
H  5.786608 -2.020278 1.3195
H  1.158949 -1.371652 -4.966302
H  2.740837 -0.91258 -4.298335
H  2.290518 -2.63041 -4.424854
elementType: S F O N C H
totalener: -2165.62581439 hartree
nucrepener: 3962.69216846 hartree
electener: -6128.31798284 hartree
twoeener: 4739.70980949 hartree
cpcmener: -0.05433594 hartree
kineticenergy: 2158.23636370 hartree
xcener: -174.624398147322 hartree
chargesum: -0.0000000
charge: 0.859874 -0.172209 -0.179796 -0.163673 -0.216472 -0.220153 -0.313121 -0.500577 -0.480782 -0.330229 -0.287372 -0.171283 0.179470 -0.393269 -0.391081 -0.408890 -0.222326 -0.008862 0.349995 -0.131541 0.296345 -0.176658 0.547546 0.206268 -0.124249 0.139014 0.427685 -0.005298 -0.031478 0.315958 -0.132457 -0.112041 0.201256 0.146879 0.143585 0.164984 0.122232 0.136337 0.125269 0.092658 0.115362 0.125820 0.115936 0.131578 0.114374 0.115396
qa: 0.8599 -0.1722 -0.1798 -0.1637 -0.2165 -0.2202 -0.3131 -0.5006 -0.4808 -0.3302 -0.2874 -0.1713 0.1795 -0.3933 -0.3911 -0.4089 -0.2223 -0.0089 0.3500 -0.1315 0.2963 -0.1767 0.5475 0.2063 -0.1242 0.1390 0.4277 -0.0053 -0.0315 0.3160 -0.1325 -0.1120 0.2013 0.1469 0.1436 0.1650 0.1222 0.1363 0.1253 0.0927 0.1154 0.1258 0.1159 0.1316 0.1144 0.1154
va: 5.8765 1.1275 1.1181 1.1284 1.0441 1.0632 2.0889 1.9942 2.0064 2.0537 2.1393 3.1042 3.4060 3.0565 2.8143 3.0599 3.8115 3.7180 3.7668 3.9422 4.2057 3.9409 4.4278 4.0396 3.9258 3.9554 4.1175 3.8434 3.9993 4.0729 3.8682 3.8414 1.0145 1.0091 1.0077 0.9885 1.0030 0.9985 1.0113 0.9980 0.9855 0.9939 0.9866 0.9932 0.9974 0.9975
dispcorr: -0.027337553 hartree
energy: -2165.653151941386
dipole: 29.35285 -24.95377 4.39909 -6.32620 7.89551 1.56932 3.25340 -2.67668 0.57672
magnitude: 4.70609 au
magnitude: 11.96194 debye
