program: Orca
programVersion: 5.0.2
elementType: S F F F F F O O O O O N N N N N C C C C C C C C C C C C C C C C H H H H H H H H H H H H H H
charge: 0
multiplicity: 1
keywords: wb97x-d3
keywords: def2-TZVPP
keywords: def2/J RIJCOSX
keywords: DEFGRID2
keywords: scfconv7
keywords: smallprint printgap noloewdin
keywords: NOSOSCF
formula: C16H14F5N5O5S
InChI: InChI=1/C16H14F5N5O5S/c1-29-10-6-22-15(30-2)26-13(10)23-14(24-26)25-32(27,28)12-8(16(19,20)21)4-3-5-9(12)31-7-11(17)18/h3-6,11,25H,7H2,1-2H3
46 atoms
S  -2.454205 -0.106343 0.604176
F  -2.616889 1.949863 -3.515714
F  -2.116681 -0.020747 -2.87947
F  -3.817806 1.022244 -2.018973
F  1.916617 1.318155 1.950729
F  2.118419 1.728727 4.092171
O  -0.891332 1.637568 2.161417
O  -3.379221 0.306064 1.637117
O  -2.916655 -0.928645 -0.487155
O  3.675837 -2.736128 1.772881
O  1.378962 -1.384878 -2.912867
N  -1.2726 -0.989993 1.377594
N  1.327409 -1.658888 -0.686291
N  0.948847 -1.786543 1.460758
N  0.057466 -1.24829 -0.549502
N  3.260096 -2.151726 -1.820681
C  -1.601195 1.333867 -0.038444
C  -1.665175 1.76245 -1.37593
C  -0.822133 2.048764 0.887003
C  -0.897508 2.84561 -1.770393
C  -0.1014 -1.348576 0.748737
C  -0.049872 3.125538 0.461709
C  -2.558059 1.156497 -2.438564
C  1.855369 -1.981659 0.524799
C  -0.089044 3.506266 -0.859445
C  3.197414 -2.431862 0.56182
C  2.042361 -1.746389 -1.840597
C  0.018709 2.08046 3.150303
C  3.843282 -2.494883 -0.641042
C  1.273765 1.232555 3.1479
C  5.02034 -3.17515 1.850755
C  2.078444 -1.41965 -4.156989
H  -1.210588 -0.861524 2.381952
H  -0.91931 3.198661 -2.789493
H  0.573433 3.680965 1.146505
H  0.510644 4.343503 -1.189246
H  0.26074 3.141688 3.062239
H  -0.492194 1.940014 4.102912
H  4.871416 -2.823496 -0.716017
H  1.087594 0.17879 3.357779
H  5.219733 -3.370515 2.901881
H  5.716295 -2.409978 1.495045
H  5.178985 -4.096538 1.28351
H  2.924117 -0.73145 -4.154238
H  2.428915 -2.425393 -4.389092
H  1.357913 -1.104887 -4.906644
elementType: S F O N C H
totalener: -2165.62597201 hartree
nucrepener: 3964.01841260 hartree
electener: -6129.64438461 hartree
twoeener: 4741.02204511 hartree
cpcmener: -0.05418712 hartree
kineticenergy: 2158.23226929 hartree
xcener: -174.624089564951 hartree
chargesum: -0.0000000
charge: 0.859848 -0.179846 -0.164214 -0.172153 -0.216913 -0.219809 -0.315822 -0.500689 -0.481539 -0.330300 -0.287948 -0.168326 0.178738 -0.394224 -0.390259 -0.409659 -0.212431 -0.011364 0.343371 -0.133189 0.295890 -0.176051 0.547273 0.208731 -0.121906 0.134902 0.427972 -0.006121 -0.029327 0.315917 -0.132410 -0.111688 0.200651 0.147049 0.144372 0.165017 0.122595 0.136600 0.125119 0.094295 0.125729 0.115399 0.115786 0.114916 0.114353 0.131666
qa: 0.8598 -0.1798 -0.1642 -0.1722 -0.2169 -0.2198 -0.3158 -0.5007 -0.4815 -0.3303 -0.2879 -0.1683 0.1787 -0.3942 -0.3903 -0.4097 -0.2124 -0.0114 0.3434 -0.1332 0.2959 -0.1761 0.5473 0.2087 -0.1219 0.1349 0.4280 -0.0061 -0.0293 0.3159 -0.1324 -0.1117 0.2007 0.1470 0.1444 0.1650 0.1226 0.1366 0.1251 0.0943 0.1257 0.1154 0.1158 0.1149 0.1144 0.1317
va: 5.8758 1.1181 1.1279 1.1278 1.0431 1.0641 2.0862 1.9942 2.0067 2.0536 2.1395 3.1099 3.4116 3.0499 2.8181 3.0593 3.8091 3.7236 3.7669 3.9442 4.2040 3.9373 4.4293 4.0335 3.9210 3.9599 4.1177 3.8449 3.9981 4.0665 3.8685 3.8414 1.0148 1.0090 1.0064 0.9884 1.0031 0.9980 1.0114 0.9977 0.9938 0.9862 0.9859 0.9974 0.9978 0.9932
dispcorr: -0.027386890 hartree
energy: -2165.653358900211
dipole: 29.55245 -25.10528 4.44717 -6.96697 8.46226 1.49529 3.94557 -3.29259 0.65298
magnitude: 4.73705 au
magnitude: 12.04062 debye
