program: Orca
programVersion: 5.0.2
elementType: S F F F F F O O O O O N N N N N C C C C C C C C C C C C C C C C H H H H H H H H H H H H H H
charge: 0
multiplicity: 1
keywords: wb97x-d3
keywords: def2-TZVPP
keywords: def2/J RIJCOSX
keywords: DEFGRID2
keywords: scfconv7
keywords: smallprint printgap noloewdin
keywords: NOSOSCF
formula: C16H14F5N5O5S
InChI: InChI=1/C16H14F5N5O5S/c1-29-10-6-22-15(30-2)26-13(10)23-14(24-26)25-32(27,28)12-8(16(19,20)21)4-3-5-9(12)31-7-11(17)18/h3-6,11,25H,7H2,1-2H3
46 atoms
S  -1.468908 0.742209 2.000615
F  -4.952058 -0.78299 -0.558351
F  -3.441018 -1.803522 0.546318
F  -4.394679 -0.027448 1.354507
F  1.799319 1.873304 -1.256063
F  2.857035 3.756445 -0.870316
O  -0.339979 2.75884 0.374404
O  -1.749289 1.932633 2.774592
O  -1.996894 -0.534689 2.418272
O  0.23647 -3.585039 -1.471087
O  4.647345 -1.049387 0.342173
N  0.186586 0.592506 2.014291
N  2.415147 -1.273353 0.291012
N  0.240847 -1.244986 0.503043
N  2.176922 -0.271815 1.156403
N  3.707284 -2.67569 -0.990664
C  -1.884365 1.020594 0.280679
C  -2.872012 0.300938 -0.413281
C  -1.13232 1.99678 -0.392474
C  -2.991114 0.470198 -1.781925
C  0.866431 -0.314191 1.236283
C  -1.257733 2.137837 -1.771988
C  -3.901662 -0.58871 0.248451
C  1.242256 -1.85249 -0.102836
C  -2.166126 1.359604 -2.453294
C  1.318309 -2.916373 -1.032618
C  3.624966 -1.701891 -0.15236
C  0.643071 3.622764 -0.164315
C  2.574525 -3.266796 -1.436975
C  1.948516 2.884006 -0.355696
C  -0.833759 -2.808518 -2.005681
C  5.950957 -1.467792 -0.068041
H  0.702317 1.405691 2.330287
H  -3.73395 -0.073825 -2.34532
H  -0.669596 2.857096 -2.322375
H  -2.259145 1.466867 -3.525395
H  0.326487 4.104861 -1.091193
H  0.789264 4.405417 0.579186
H  2.705207 -4.074443 -2.14733
H  2.349368 2.462054 0.565876
H  -1.458241 -3.494621 -2.574518
H  -0.468991 -2.028516 -2.677861
H  -1.436143 -2.356342 -1.219158
H  6.643907 -0.813379 0.45266
H  6.141943 -2.50189 0.21757
H  6.082559 -1.356482 -1.143937
elementType: S F O N C H
totalener: -2165.62136058 hartree
nucrepener: 3982.79119812 hartree
electener: -6148.41255870 hartree
twoeener: 4758.61827870 hartree
cpcmener: -0.05141574 hartree
kineticenergy: 2158.22391830 hartree
xcener: -174.622640815216 hartree
chargesum: -0.0000000
charge: 0.863344 -0.178973 -0.163933 -0.172439 -0.216826 -0.219729 -0.312524 -0.504545 -0.483439 -0.355127 -0.286805 -0.165740 0.179232 -0.412979 -0.389694 -0.409790 -0.160203 -0.039754 0.315871 -0.156002 0.289118 -0.158857 0.560940 0.244870 -0.122923 0.086598 0.435057 -0.005259 -0.010374 0.317993 -0.093523 -0.112107 0.200845 0.143929 0.144565 0.163934 0.122328 0.136496 0.136416 0.093912 0.122312 0.112346 0.096174 0.132600 0.117015 0.115648
qa: 0.8633 -0.1790 -0.1639 -0.1724 -0.2168 -0.2197 -0.3125 -0.5045 -0.4834 -0.3551 -0.2868 -0.1657 0.1792 -0.4130 -0.3897 -0.4098 -0.1602 -0.0398 0.3159 -0.1560 0.2891 -0.1589 0.5609 0.2449 -0.1229 0.0866 0.4351 -0.0053 -0.0104 0.3180 -0.0935 -0.1121 0.2008 0.1439 0.1446 0.1639 0.1223 0.1365 0.1364 0.0939 0.1223 0.1123 0.0962 0.1326 0.1170 0.1156
va: 5.8713 1.1197 1.1228 1.1294 1.0435 1.0646 2.0937 1.9902 2.0036 2.0312 2.1434 3.1232 3.3826 3.0506 2.8305 3.0486 3.7503 3.6826 3.8144 3.9226 4.2272 3.9333 4.4049 3.9085 3.9054 3.8762 4.1252 3.8445 4.0792 4.0673 3.8353 3.8392 1.0141 1.0105 1.0052 0.9884 1.0032 0.9985 1.0055 0.9934 0.9971 0.9918 1.0005 0.9929 0.9976 0.9973
dispcorr: -0.029426907 hartree
energy: -2165.650787489653
dipole: 23.03905 -20.47191 2.56715 -2.69984 4.49940 1.79956 -13.62694 10.27084 -3.35610
magnitude: 4.59261 au
magnitude: 11.67349 debye
