program: Orca
programVersion: 5.0.2
elementType: S F F F F F O O O O O N N N N N C C C C C C C C C C C C C C C C H H H H H H H H H H H H H H
charge: 0
multiplicity: 1
keywords: wb97x-d3
keywords: def2-TZVPP
keywords: def2/J RIJCOSX
keywords: DEFGRID2
keywords: scfconv7
keywords: smallprint printgap noloewdin
keywords: NOSOSCF
formula: C16H14F5N5O5S
InChI: InChI=1/C16H14F5N5O5S/c1-29-10-6-22-15(30-2)26-13(10)23-14(24-26)25-32(27,28)12-8(16(19,20)21)4-3-5-9(12)31-7-11(17)18/h3-6,11,25H,7H2,1-2H3
46 atoms
S  -1.480951 0.777253 2.009006
F  -4.968047 -0.823657 -0.492657
F  -3.44721 -1.800998 0.635835
F  -4.407039 -0.006282 1.39458
F  1.700694 1.593482 -1.29658
F  2.88671 3.429231 -1.115803
O  -0.317823 2.724101 0.30346
O  -1.771479 1.985784 2.749607
O  -2.006833 -0.491118 2.454094
O  0.293961 -3.485916 -1.507394
O  4.666967 -0.98855 0.446527
N  0.175385 0.633755 2.045621
N  2.437195 -1.219935 0.354982
N  0.258898 -1.18721 0.51722
N  2.182474 -0.237727 1.236943
N  3.754668 -2.588677 -0.936951
C  -1.893359 1.007063 0.279067
C  -2.891829 0.275527 -0.387488
C  -1.135213 1.952068 -0.42854
C  -3.020543 0.407804 -1.759204
C  0.870013 -0.272201 1.281387
C  -1.274104 2.059205 -1.809809
C  -3.915316 -0.598293 0.303966
C  1.271877 -1.786834 -0.077428
C  -2.196117 1.273126 -2.461958
C  1.366372 -2.829246 -1.02932
C  3.655286 -1.634736 -0.077745
C  0.711574 3.494777 -0.287152
C  2.630787 -3.170114 -1.417289
C  1.957963 2.660513 -0.486817
C  -0.777571 -2.694949 -2.019567
C  5.978466 -1.37642 0.031395
H  0.682436 1.45162 2.365319
H  -3.770508 -0.147788 -2.301383
H  -0.682693 2.756866 -2.383982
H  -2.29858 1.353455 -3.535519
H  0.404003 3.970492 -1.220504
H  0.933199 4.28771 0.426209
H  2.775426 -3.960623 -2.143861
H  2.384803 2.28389 0.44244
H  -1.379355 -3.356232 -2.64033
H  -0.411406 -1.872083 -2.638244
H  -1.402563 -2.298555 -1.220326
H  6.659317 -0.728013 0.57515
H  6.182972 -2.415813 0.287174
H  6.113958 -1.231009 -1.040121
elementType: S F O N C H
totalener: -2165.62067390 hartree
nucrepener: 4003.13868882 hartree
electener: -6168.75936273 hartree
twoeener: 4778.94853148 hartree
cpcmener: -0.05079017 hartree
kineticenergy: 2158.22777775 hartree
xcener: -174.623968657073 hartree
chargesum: -0.0000000
charge: 0.862888 -0.179386 -0.163832 -0.172621 -0.216622 -0.218696 -0.313255 -0.503823 -0.484277 -0.354664 -0.287805 -0.163841 0.185752 -0.409243 -0.392653 -0.408825 -0.145971 -0.043941 0.301887 -0.155175 0.283202 -0.152308 0.558995 0.238281 -0.125456 0.091196 0.435444 -0.004883 -0.012072 0.314984 -0.094460 -0.112112 0.199260 0.144032 0.145864 0.163726 0.122016 0.136662 0.136333 0.097440 0.122341 0.113345 0.097089 0.132434 0.116856 0.115895
qa: 0.8629 -0.1794 -0.1638 -0.1726 -0.2166 -0.2187 -0.3133 -0.5038 -0.4843 -0.3547 -0.2878 -0.1638 0.1858 -0.4092 -0.3927 -0.4088 -0.1460 -0.0439 0.3019 -0.1552 0.2832 -0.1523 0.5590 0.2383 -0.1255 0.0912 0.4354 -0.0049 -0.0121 0.3150 -0.0945 -0.1121 0.1993 0.1440 0.1459 0.1637 0.1220 0.1367 0.1363 0.0974 0.1223 0.1133 0.0971 0.1324 0.1169 0.1159
va: 5.8691 1.1193 1.1234 1.1290 1.0433 1.0658 2.0935 1.9911 2.0030 2.0325 2.1409 3.1242 3.3714 3.0457 2.8234 3.0500 3.7466 3.6870 3.8244 3.9125 4.2254 3.9204 4.4093 3.9101 3.8968 3.8760 4.1223 3.8460 4.0791 4.0567 3.8361 3.8395 1.0152 1.0106 1.0035 0.9886 1.0032 0.9976 1.0055 0.9941 0.9973 0.9916 1.0009 0.9928 0.9975 0.9972
dispcorr: -0.030066909 hartree
energy: -2165.650740811154
dipole: 23.53276 -20.87638 2.65638 -1.95120 3.73790 1.78671 -13.69924 10.31252 -3.38672
magnitude: 4.66032 au
magnitude: 11.84558 debye
