program: Orca
programVersion: 5.0.2
elementType: S F F F F F O O O O O N N N N N C C C C C C C C C C C C C C C C H H H H H H H H H H H H H H
charge: 0
multiplicity: 1
keywords: wb97x-d3
keywords: def2-TZVPP
keywords: def2/J RIJCOSX
keywords: DEFGRID2
keywords: scfconv7
keywords: smallprint printgap noloewdin
keywords: NOSOSCF
formula: C16H14F5N5O5S
InChI: InChI=1/C16H14F5N5O5S/c1-29-10-6-22-15(30-2)26-13(10)23-14(24-26)25-32(27,28)12-8(16(19,20)21)4-3-5-9(12)31-7-11(17)18/h3-6,11,25H,7H2,1-2H3
46 atoms
S  -1.563369 1.211281 -1.105024
F  -4.722935 -1.156675 1.294937
F  -4.483655 0.13257 -0.383494
F  -3.287215 -1.671902 -0.191853
F  2.257493 5.164785 1.277452
F  2.214613 3.52548 -0.169914
O  -0.184153 2.660464 0.862775
O  -2.259987 0.173775 -1.825707
O  -1.779893 2.600128 -1.45229
O  -0.035214 -4.05096 0.374736
O  4.345207 -1.662859 -1.672015
N  0.057948 0.958249 -1.321323
N  2.183298 -1.647732 -1.058924
N  0.082736 -1.301835 -0.57405
N  1.964097 -0.375657 -1.427835
N  3.40557 -3.571035 -0.784573
C  -1.825265 1.015394 0.655028
C  -2.772271 0.157638 1.239001
C  -1.01619 1.817598 1.478626
C  -2.832553 0.062981 2.620807
C  0.696927 -0.239447 -1.111968
C  -1.09422 1.705021 2.863048
C  -3.805125 -0.638697 0.468643
C  1.04652 -2.199012 -0.553611
C  -1.990435 0.819582 3.418933
C  1.099699 -3.547609 -0.123155
C  3.346319 -2.346504 -1.164467
C  0.668836 3.49973 1.613882
C  2.304117 -4.176816 -0.267582
C  1.429887 4.324509 0.604398
C  -0.011883 -5.39898 0.809305
C  5.59211 -2.342366 -1.818495
H  0.631066 1.781534 -1.463282
H  -3.543776 -0.592172 3.098964
H  -0.46652 2.304268 3.507536
H  -2.051716 0.727029 4.494594
H  0.093587 4.172456 2.256598
H  1.361851 2.92091 2.232685
H  2.443579 -5.208166 0.027962
H  0.784799 4.911152 -0.050068
H  0.70037 -5.5490 1.624883
H  0.229403 -6.083432 -0.00796
H  -1.01186 -5.623538 1.171346
H  5.98011 -2.673525 -0.85523
H  5.500833 -3.198172 -2.487193
H  6.272304 -1.614496 -2.251437
elementType: S F O N C H
totalener: -2165.63025437 hartree
nucrepener: 3838.51841705 hartree
electener: -6004.14867142 hartree
twoeener: 4616.02448465 hartree
cpcmener: -0.05442424 hartree
kineticenergy: 2158.23556082 hartree
xcener: -174.626803397962 hartree
chargesum: -0.0000000
charge: 0.861478 -0.179993 -0.171907 -0.162636 -0.217551 -0.219594 -0.308239 -0.484422 -0.503514 -0.327808 -0.288858 -0.175222 0.163396 -0.411597 -0.372282 -0.407819 -0.292318 0.010162 0.434274 -0.143451 0.311082 -0.210467 0.546986 0.196611 -0.119570 0.161523 0.427246 0.006495 -0.037773 0.292413 -0.131830 -0.111123 0.205916 0.147515 0.143034 0.164746 0.129813 0.127392 0.124582 0.105581 0.114738 0.115497 0.126503 0.114079 0.114676 0.132240
qa: 0.8615 -0.1800 -0.1719 -0.1626 -0.2176 -0.2196 -0.3082 -0.4844 -0.5035 -0.3278 -0.2889 -0.1752 0.1634 -0.4116 -0.3723 -0.4078 -0.2923 0.0102 0.4343 -0.1435 0.3111 -0.2105 0.5470 0.1966 -0.1196 0.1615 0.4272 0.0065 -0.0378 0.2924 -0.1318 -0.1111 0.2059 0.1475 0.1430 0.1647 0.1298 0.1274 0.1246 0.1056 0.1147 0.1155 0.1265 0.1141 0.1147 0.1322
va: 5.8844 1.1180 1.1269 1.1319 1.0629 1.0481 2.0954 2.0093 1.9850 2.0568 2.1387 3.1237 3.4144 3.0498 2.8631 3.0565 3.8858 3.6985 3.7109 3.9546 4.2230 3.9559 4.4329 4.0819 3.9426 3.9170 4.1228 3.7888 4.0044 4.1373 3.8678 3.8412 1.0173 1.0088 1.0077 0.9889 0.9939 0.9998 1.0119 0.9842 0.9861 0.9860 0.9939 0.9977 0.9978 0.9931
dispcorr: -0.024534808 hartree
energy: -2165.654789182729
dipole: 24.57457 -21.96609 2.60847 -17.81603 16.87795 -0.93808 8.71794 -4.99021 3.72773
magnitude: 4.64543 au
magnitude: 11.80776 debye
