program: Orca
programVersion: 5.0.2
elementType: S F F F F F O O O O O N N N N N C C C C C C C C C C C C C C C C H H H H H H H H H H H H H H
charge: 0
multiplicity: 1
keywords: wb97x-d3
keywords: def2-TZVPP
keywords: def2/J RIJCOSX
keywords: DEFGRID2
keywords: scfconv7
keywords: smallprint printgap noloewdin
keywords: NOSOSCF
formula: C16H14F5N5O5S
InChI: InChI=1/C16H14F5N5O5S/c1-29-10-6-22-15(30-2)26-13(10)23-14(24-26)25-32(27,28)12-8(16(19,20)21)4-3-5-9(12)31-7-11(17)18/h3-6,11,25H,7H2,1-2H3
46 atoms
S  -1.548251 1.194888 -1.021341
F  -4.424478 0.233385 -0.150362
F  -3.394205 -1.671507 -0.191882
F  -4.652514 -1.156661 1.452601
F  1.738048 5.465118 1.33252
F  1.87913 3.968421 -0.263493
O  0.054053 2.406012 0.964875
O  -2.272928 0.188848 -1.745397
O  -1.780726 2.603847 -1.227663
O  0.35708 -4.072707 0.651209
O  4.468923 -1.475256 -1.700395
N  0.068825 0.979025 -1.363416
N  2.315184 -1.525345 -1.050987
N  0.210393 -1.24601 -0.524746
N  2.028069 -0.281115 -1.470889
N  3.647429 -3.362706 -0.675994
C  -1.669903 0.850308 0.744923
C  -2.603626 -0.015943 1.324898
C  -0.761104 1.52986 1.567813
C  -2.540543 -0.255677 2.692351
C  0.762395 -0.181838 -1.129068
C  -0.704487 1.270012 2.93033
C  -3.762593 -0.656867 0.580738
C  1.209307 -2.10353 -0.482722
C  -1.586301 0.362473 3.478796
C  1.348761 -3.421533 0.022929
C  3.509607 -2.167635 -1.132462
C  0.707261 3.40963 1.69732
C  2.584895 -3.985729 -0.1150
C  1.064102 4.481382 0.690128
C  -0.879563 -4.168179 -0.04357
C  5.736095 -2.10945 -1.808109
H  0.61172 1.824164 -1.472526
H  -3.245282 -0.923687 3.161021
H  0.02472 1.762052 3.559771
H  -1.54424 0.146646 4.537421
H  0.053498 3.843912 2.461316
H  1.614139 3.033754 2.185108
H  2.759222 -4.988411 0.254826
H  0.18544 4.904788 0.198947
H  -1.525632 -4.795144 0.566465
H  -0.74895 -4.64286 -1.019963
H  -1.348272 -3.195517 -0.180179
H  6.382223 -1.388349 -2.299698
H  6.140406 -2.360762 -0.827512
H  5.676359 -3.020024 -2.404226
totalener: -2165.59089804 hartree
nucrepener: 3876.21918941 hartree
electener: -6041.81008745 hartree
twoeener: 4651.57113112 hartree
kineticenergy: 2158.29081472 hartree
xcener: -174.625756251126 hartree
chargesum: -0.0000000
charge: 0.849883 -0.153430 -0.149237 -0.177799 -0.195484 -0.196944 -0.297913 -0.420619 -0.454069 -0.312910 -0.249783 -0.186573 0.141920 -0.409967 -0.326441 -0.371908 -0.234864 -0.007634 0.364170 -0.132433 0.298022 -0.205777 0.542339 0.243160 -0.095968 0.078779 0.393041 -0.026592 -0.027441 0.290905 -0.114604 -0.120009 0.176642 0.130735 0.126128 0.135829 0.107415 0.109684 0.119811 0.088464 0.109293 0.097986 0.120713 0.126067 0.108096 0.109315
qa: 0.8499 -0.1534 -0.1492 -0.1778 -0.1955 -0.1969 -0.2979 -0.4206 -0.4541 -0.3129 -0.2498 -0.1866 0.1419 -0.4100 -0.3264 -0.3719 -0.2349 -0.0076 0.3642 -0.1324 0.2980 -0.2058 0.5423 0.2432 -0.0960 0.0788 0.3930 -0.0266 -0.0274 0.2909 -0.1146 -0.1200 0.1766 0.1307 0.1261 0.1358 0.1074 0.1097 0.1198 0.0885 0.1093 0.0980 0.1207 0.1261 0.1081 0.1093
va: 5.8867 1.1566 1.1409 1.1179 1.0924 1.0787 2.0852 2.0816 2.0399 2.0647 2.1700 3.1409 3.4172 3.0460 2.8581 3.0628 3.9410 3.7578 3.7344 4.0027 4.1977 3.9983 4.4224 3.8594 3.9811 3.8972 4.1467 3.8646 4.0891 4.1782 3.8477 3.8660 1.0403 1.0174 1.0091 0.9998 0.9981 0.9996 1.0097 0.9875 0.9956 0.9952 0.9898 0.9925 0.9997 0.9998
dispcorr: -0.026328389 hartree
energy: -2165.617226430842
dipole: 23.20369 -21.57289 1.63079 -15.43271 15.00835 -0.42436 5.59277 -3.58697 2.00580
magnitude: 2.61969 au
magnitude: 6.65873 debye
