program: Orca
programVersion: 5.0.2
elementType: S F F F F F O O O O O N N N N N C C C C C C C C C C C C C C C C H H H H H H H H H H H H H H
charge: 0
multiplicity: 1
keywords: wb97x-d3
keywords: def2-TZVPP
keywords: def2/J RIJCOSX
keywords: DEFGRID2
keywords: scfconv7
keywords: smallprint printgap noloewdin
keywords: NOSOSCF
formula: C16H14F5N5O5S
InChI: InChI=1/C16H14F5N5O5S/c1-29-10-6-22-15(30-2)26-13(10)23-14(24-26)25-32(27,28)12-8(16(19,20)21)4-3-5-9(12)31-7-11(17)18/h3-6,11,25H,7H2,1-2H3
46 atoms
S  -1.600886 1.17001 -1.056936
F  -4.574232 -1.194409 1.564812
F  -4.425071 0.139194 -0.094242
F  -3.330949 -1.732328 -0.082965
F  2.276931 5.156378 1.146552
F  2.169092 3.595596 -0.383288
O  0.007288 2.493709 0.85996
O  -2.324155 0.134633 -1.738567
O  -1.853803 2.568781 -1.3009
O  0.226176 -4.177245 0.333125
O  4.533824 -1.275113 -1.153435
N  0.01617 0.961602 -1.41952
N  2.31181 -1.453497 -0.863514
N  0.138845 -1.294543 -0.663828
N  2.031917 -0.197085 -1.251236
N  3.655419 -3.258778 -0.387773
C  -1.672988 0.878699 0.722799
C  -2.566221 0.003535 1.351526
C  -0.760229 1.604896 1.504601
C  -2.461576 -0.198744 2.72259
C  0.723793 -0.174413 -1.1162
C  -0.66302 1.381754 2.871654
C  -3.718834 -0.700829 0.655134
C  1.161219 -2.109042 -0.510081
C  -1.505686 0.466204 3.466483
C  1.280262 -3.452831 -0.074538
C  3.533333 -2.042288 -0.789062
C  0.883854 3.33318 1.563226
C  2.548009 -3.960185 -0.047179
C  1.444681 4.285733 0.530138
C  -0.855302 -4.291594 -0.584885
C  5.831838 -1.851357 -1.105773
H  0.555988 1.810957 -1.509412
H  -3.134071 -0.874245 3.226402
H  0.059773 1.913479 3.474672
H  -1.431624 0.283208 4.529566
H  0.359168 3.909252 2.333674
H  1.699023 2.772901 2.036209
H  2.710414 -4.979755 0.279285
H  0.665382 4.84309 0.005175
H  -1.582946 -4.951203 -0.118304
H  -0.52617 -4.739757 -1.526364
H  -1.323631 -3.329831 -0.788815
H  6.508905 -1.07311 -1.445185
H  6.095672 -2.156047 -0.093008
H  5.907103 -2.718882 -1.761363
totalener: -2165.59143411 hartree
nucrepener: 3889.55947784 hartree
electener: -6055.15091195 hartree
twoeener: 4664.94769502 hartree
kineticenergy: 2158.29511993 hartree
xcener: -174.625522244115 hartree
chargesum: 0.0000000
charge: 0.848171 -0.178408 -0.153996 -0.146509 -0.194086 -0.193313 -0.295381 -0.416406 -0.448338 -0.312784 -0.250042 -0.191457 0.142810 -0.401279 -0.331322 -0.372139 -0.286790 0.012482 0.399671 -0.129098 0.282253 -0.202733 0.540737 0.242209 -0.109891 0.082007 0.392016 -0.017537 -0.025150 0.278098 -0.119598 -0.120073 0.180488 0.130948 0.120390 0.135417 0.110277 0.110828 0.120064 0.090002 0.110952 0.095582 0.127765 0.125962 0.107673 0.109528
qa: 0.8482 -0.1784 -0.1540 -0.1465 -0.1941 -0.1933 -0.2954 -0.4164 -0.4483 -0.3128 -0.2500 -0.1915 0.1428 -0.4013 -0.3313 -0.3721 -0.2868 0.0125 0.3997 -0.1291 0.2823 -0.2027 0.5407 0.2422 -0.1099 0.0820 0.3920 -0.0175 -0.0252 0.2781 -0.1196 -0.1201 0.1805 0.1309 0.1204 0.1354 0.1103 0.1108 0.1201 0.0900 0.1110 0.0956 0.1278 0.1260 0.1077 0.1095
va: 5.8912 1.1177 1.1560 1.1478 1.0941 1.0824 2.1020 2.0824 2.0495 2.0655 2.1693 3.1356 3.4118 3.0379 2.8404 3.0626 3.9415 3.7547 3.6989 4.0048 4.1993 3.9923 4.4247 3.8537 4.0050 3.8944 4.1487 3.8391 4.0884 4.1862 3.8457 3.8664 1.0398 1.0176 1.0136 1.0004 0.9962 1.0004 1.0096 0.9856 0.9956 0.9936 0.9893 0.9924 0.9996 0.9998
dispcorr: -0.026307536 hartree
energy: -2165.617741643811
dipole: 23.33949 -21.54961 1.78987 -13.98807 13.76831 -0.21975 5.41100 -3.41985 1.99115
magnitude: 2.68638 au
magnitude: 6.82823 debye
