program: Orca
programVersion: 5.0.2
elementType: S F F F F F O O O O O N N N N N C C C C C C C C C C C C C C C C H H H H H H H H H H H H H H
charge: 0
multiplicity: 1
keywords: wb97x-d3
keywords: def2-TZVPP
keywords: def2/J RIJCOSX
keywords: DEFGRID2
keywords: scfconv7
keywords: smallprint printgap noloewdin
keywords: NOSOSCF
formula: C16H14F5N5O5S
InChI: InChI=1/C16H14F5N5O5S/c1-29-10-6-22-15(30-2)26-13(10)23-14(24-26)25-32(27,28)12-8(16(19,20)21)4-3-5-9(12)31-7-11(17)18/h3-6,11,25H,7H2,1-2H3
46 atoms
S  -1.675215 1.296042 -1.340466
F  -3.673226 -1.478605 -0.661912
F  -4.89315 -0.968815 1.010688
F  -4.569038 0.496197 -0.504957
F  1.888263 4.097354 -0.146953
F  3.430117 3.411845 1.254742
O  0.195461 2.10833 0.710335
O  -2.437217 0.358991 -2.114023
O  -1.895154 2.718219 -1.424025
O  0.400403 -4.060306 -0.025681
O  4.544794 -0.673809 -0.762105
N  -0.064434 1.094109 -1.775599
N  2.337459 -1.089415 -0.828762
N  0.157425 -1.156503 -1.020453
N  1.998546 0.135832 -1.265769
N  3.765966 -2.749708 -0.136107
C  -1.738628 0.812311 0.399868
C  -2.761556 0.018573 0.937869
C  -0.740371 1.315398 1.252208
C  -2.724829 -0.3165 2.286065
C  0.689126 0.02441 -1.365771
C  -0.731256 0.974732 2.600436
C  -3.97129 -0.483213 0.164325
C  1.215877 -1.862476 -0.6740
C  -1.714128 0.150114 3.103458
C  1.3992 -3.184094 -0.193543
C  3.586589 -1.549544 -0.561396
C  1.329217 2.467594 1.463552
C  2.693191 -3.551887 0.056828
C  2.367864 3.015881 0.507394
C  -0.807747 -3.591896 0.558947
C  5.87577 -1.11244 -0.520231
H  0.435084 1.970699 -1.84553
H  -3.500569 -0.929029 2.71663
H  0.026532 1.360849 3.266955
H  -1.705939 -0.114641 4.151843
H  1.081017 3.223239 2.217588
H  1.765592 1.598859 1.968115
H  2.902921 -4.550093 0.420136
H  2.703094 2.278417 -0.224629
H  -1.371139 -2.951874 -0.118167
H  -0.61791 -3.046556 1.4881
H  -1.393176 -4.47927 0.787786
H  6.014876 -1.410282 0.518993
H  6.140301 -1.951563 -1.163189
H  6.509015 -0.260064 -0.74777
totalener: -2165.58903419 hartree
nucrepener: 3955.76481992 hartree
electener: -6121.35385410 hartree
twoeener: 4729.99944935 hartree
kineticenergy: 2158.27806646 hartree
xcener: -174.622793317817 hartree
chargesum: -0.0000000
charge: 0.842294 -0.146257 -0.177260 -0.150984 -0.191046 -0.201784 -0.285729 -0.412495 -0.433808 -0.303412 -0.260593 -0.174460 0.163726 -0.363982 -0.389908 -0.366400 -0.221039 -0.043582 0.392687 -0.151918 0.273313 -0.205819 0.544552 0.224398 -0.115638 0.098216 0.392218 -0.024260 -0.032308 0.270592 -0.111627 -0.118258 0.166149 0.134326 0.125550 0.137347 0.125084 0.099019 0.122073 0.096367 0.123594 0.088458 0.115246 0.108695 0.112531 0.126133
qa: 0.8423 -0.1463 -0.1773 -0.1510 -0.1910 -0.2018 -0.2857 -0.4125 -0.4338 -0.3034 -0.2606 -0.1745 0.1637 -0.3640 -0.3899 -0.3664 -0.2210 -0.0436 0.3927 -0.1519 0.2733 -0.2058 0.5446 0.2244 -0.1156 0.0982 0.3922 -0.0243 -0.0323 0.2706 -0.1116 -0.1183 0.1661 0.1343 0.1255 0.1373 0.1251 0.0990 0.1221 0.0964 0.1236 0.0885 0.1152 0.1087 0.1125 0.1261
va: 5.8682 1.1490 1.1182 1.1607 1.0874 1.0846 2.1212 2.0824 2.0678 2.0854 2.1535 3.1451 3.3856 3.0314 2.7882 3.0709 3.8648 3.7611 3.7162 3.9632 4.1799 3.9799 4.4304 3.8597 3.9834 3.9008 4.1332 3.8252 4.0760 4.1670 3.8584 3.8628 1.0440 1.0183 1.0112 0.9997 1.0027 0.9981 1.0095 1.0013 1.0003 0.9941 0.9969 0.9993 0.9996 0.9923
dispcorr: -0.028937524 hartree
energy: -2165.617971708784
dipole: 25.30073 -23.12099 2.17974 -14.06258 13.02550 -1.03708 12.02452 -9.49236 2.53216
magnitude: 3.49838 au
magnitude: 8.89216 debye
