program: Orca
programVersion: 5.0.2
elementType: S F F F F F O O O O O N N N N N C C C C C C C C C C C C C C C C H H H H H H H H H H H H H H
charge: 0
multiplicity: 1
keywords: wb97x-d3
keywords: def2-TZVPP
keywords: def2/J RIJCOSX
keywords: DEFGRID2
keywords: scfconv7
keywords: smallprint printgap noloewdin
keywords: NOSOSCF
formula: C16H14F5N5O5S
InChI: InChI=1/C16H14F5N5O5S/c1-29-10-6-22-15(30-2)26-13(10)23-14(24-26)25-32(27,28)12-8(16(19,20)21)4-3-5-9(12)31-7-11(17)18/h3-6,11,25H,7H2,1-2H3
46 atoms
S  -0.913987 0.98219 1.599026
F  -4.769098 -0.964618 0.013559
F  -3.108312 -1.703296 1.128924
F  -3.949377 0.25021 1.565671
F  1.841183 4.047713 0.478746
F  0.851482 5.75959 -0.470755
O  0.133164 2.309717 -0.702412
O  -1.048868 2.366662 1.992499
O  -1.421705 -0.09214 2.403824
O  0.220352 -4.047042 -1.215592
O  4.912377 -1.591066 -0.138687
N  0.725724 0.739387 1.44073
N  2.666136 -1.632815 0.011732
N  0.519259 -1.347651 0.316457
N  2.571728 -0.467806 0.673371
N  3.748057 -3.351173 -1.058859
C  -1.571183 0.820248 -0.073785
C  -2.698189 0.060125 -0.413025
C  -0.914576 1.548764 -1.068703
C  -3.073779 -0.026893 -1.747153
C  1.270333 -0.361176 0.821573
C  -1.300387 1.44681 -2.398501
C  -3.618151 -0.599187 0.598261
C  1.41864 -2.164799 -0.200583
C  -2.368765 0.643047 -2.732641
C  1.345887 -3.3957 -0.901862
C  3.803293 -2.236351 -0.421458
C  0.24126 3.62995 -1.189202
C  2.547547 -3.92411 -1.295632
C  0.660573 4.495826 -0.018759
C  -1.030648 -3.609096 -0.713161
C  6.124072 -2.186926 -0.580017
H  1.289562 1.578505 1.440915
H  -3.935795 -0.609995 -2.031144
H  -0.756385 1.98513 -3.164057
H  -2.670627 0.547489 -3.766446
H  0.991381 3.689121 -1.984375
H  -0.71219 3.996753 -1.580969
H  2.563524 -4.860442 -1.839136
H  -0.072834 4.505892 0.788146
H  -1.310784 -2.632113 -1.107671
H  -1.045917 -3.561294 0.375561
H  -1.752807 -4.350341 -1.047283
H  6.914516 -1.517572 -0.253605
H  6.26896 -3.172963 -0.138306
H  6.147996 -2.28531 -1.665621
totalener: -2165.58847831 hartree
nucrepener: 3902.48597061 hartree
electener: -6068.07444892 hartree
twoeener: 4677.52941210 hartree
kineticenergy: 2158.29145508 hartree
xcener: -174.627893952894 hartree
chargesum: -0.0000000
charge: 0.870838 -0.177551 -0.147795 -0.153176 -0.200583 -0.198585 -0.322928 -0.471566 -0.419164 -0.286900 -0.252810 -0.188037 0.143024 -0.409143 -0.324871 -0.366253 -0.122898 -0.094502 0.259196 -0.119081 0.280891 -0.181734 0.548020 0.201847 -0.080401 0.159281 0.385330 -0.006441 -0.056868 0.286708 -0.095915 -0.119996 0.177454 0.133579 0.139500 0.138901 0.106289 0.102705 0.115920 0.095026 0.078399 0.118301 0.114685 0.125222 0.109219 0.106863
qa: 0.8708 -0.1776 -0.1478 -0.1532 -0.2006 -0.1986 -0.3229 -0.4716 -0.4192 -0.2869 -0.2528 -0.1880 0.1430 -0.4091 -0.3249 -0.3663 -0.1229 -0.0945 0.2592 -0.1191 0.2809 -0.1817 0.5480 0.2018 -0.0804 0.1593 0.3853 -0.0064 -0.0569 0.2867 -0.0959 -0.1200 0.1775 0.1336 0.1395 0.1389 0.1063 0.1027 0.1159 0.0950 0.0784 0.1183 0.1147 0.1252 0.1092 0.1069
va: 5.8522 1.1188 1.1495 1.1573 1.0717 1.0899 2.0293 2.0189 2.0863 2.1079 2.1648 3.1556 3.4282 3.0209 2.8533 3.0705 3.9065 3.7315 3.8169 3.9350 4.2156 4.0076 4.4301 3.8846 3.9374 3.9053 4.1450 3.8503 4.0712 4.1684 3.8785 3.8679 1.0418 1.0168 0.9990 0.9977 1.0021 1.0003 1.0114 0.9910 0.9972 0.9979 0.9923 0.9925 0.9996 0.9996
dispcorr: -0.027855473 hartree
energy: -2165.616333779536
dipole: 19.64038 -19.03576 0.60462 -13.07389 12.91183 -0.16206 -17.42589 14.72586 -2.70003
magnitude: 2.77164 au
magnitude: 7.04496 debye
